{"text_format":"1","workbook":"xlsx","n_sheets":43,"sheets":["START","Instructions","Template names","Lookup and lists","Org structure","Contacts","B1-Sum","B2-FinPerf SC","B2B","B3-FinPerf V","B3B","B4-FinPerf RE","B5-Capex","B5B","B6-FinPos","B7-CFlow","B8-ResRecon","B9-Asset","B10-SerDel","SB1","SB2","SB3","SB4","SB5","SB6","SB7","SB8","SB9","SB10","SB11","SB12","SB13","SB14","SB15","SB16","SB17","SB18a","SB18b","SB18c","SB18d","SB18e","SB19","SB20"],"not_rendered":{"charts":0,"images":18,"macros":1,"external_links":8,"defined_names":1923,"comments":1,"pivot_tables":0},"unopened":[],"bounds":{"document_bytes":16777216,"sheet_cells":100000,"rows_first":2000,"rows_last":500,"rows_between":2000,"halvings":0,"cell_chars":16384,"cell_head_chars":4096},"cells_cut":0,"cells_raw":0,"read":"whole","date_system":"1900"}

{"sheet":"START","index":0,"n_rows":1,"n_cols":1,"rows_kept":1,"cut":false,"hidden":false,"merged":[]}
[{"$f":"muni","v":"LIM332 Greater Letaba"}]

{"sheet":"Instructions","index":1,"n_rows":38,"n_cols":24,"rows_kept":38,"cut":false,"hidden":false,"merged":[]}
[]
[null,null,null,2020]
[]
[null,null,null,null,null,null,null,null,null,null,null,null,null,null,null,null,null,null,null,null,null,null,null,"Yes"]
[null,null,null,null,null,null,null,null,null,null,null,null,null,null,null,null,null,null,null,null,null,null,null,"No"]
[]
[null,null,null,null,null,null,null,null,null,null,null,null,null,null,null,null,null,null,null,null,null,null,"Type of Entities Range:","Parent Municipality"]
[null,null,null,null,null,null,null,null,null,null,null,null,null,null,null,null,null,null,null,null,null,null,null,"Consolidated Information"]
[]
[null,null,null,null,null,null,null,null,null,null,null,null,null,null,null,null,null,null,null,null,null,null,"Date of Adjustment","27 February 2019"]
[]
[]
[]
[]
[]
[]
[]
[]
[null,null,null,null,null,null,null,null,null,null,null,null,null,null,null,null,null,null,null,null,null,null,"MTREF Range:",2008]
[null,null,null,null,null,null,null,null,null,null,null,null,null,null,null,null,null,null,null,null,null,null,null,2009]
[null,null,null,null,null,null,null,null,null,null,null,null,null,null,null,null,null,null,null,null,null,null,null,2010]
[null,null,null,null,null,null,null,null,null,null,null,null,null,null,null,null,null,null,null,null,null,null,null,2011]
[null,null,null,null,null,null,null,null,null,null,null,null,null,null,null,null,null,null,null,null,null,null,null,2012]
[null,null,null,null,null,null,null,null,null,null,null,null,null,null,null,null,null,null,null,null,null,null,null,2013]
[null,null,null,null,null,null,null,null,null,null,null,null,null,null,null,null,null,null,null,null,null,null,null,2014]
[null,null,null,null,null,null,null,null,null,null,null,null,null,null,null,null,null,null,null,null,null,null,null,2015]
[null,null,null,null,null,null,null,null,null,null,null,null,null,null,null,null,null,null,null,null,null,null,null,2016]
[null,null,null,null,null,null,null,null,null,null,null,null,null,null,null,null,null,null,null,null,null,null,null,2017]
[null,null,null,null,null,null,null,null,null,null,null,null,null,null,null,null,null,null,null,null,null,null,null,2018]
[null,null,null,null,null,null,null,null,null,null,null,null,null,null,null,null,null,null,null,null,null,null,null,2019]
[null,null,null,null,null,null,null,null,null,null,null,null,null,null,null,null,null,null,null,null,null,null,null,2020]
[null,null,null,null,null,null,null,null,null,null,null,null,null,null,null,null,null,null,null,null,null,null,null,2021]
[null,null,null,null,null,null,null,null,null,null,null,null,null,null,null,null,null,null,null,null,null,null,"MTREF Linked:",2022]
[null,null,null,null,null,null,null,null,null,null,null,null,null,null,null,null,null,null,null,null,null,null,"MTREF:"]
[null,null,null,null,null,null,null,null,null,null,null,null,null,null,null,null,null,null,null,null,null,null,null,11]
[null,null,null,null,null,null,null,null,null,null,null,null,null,null,null,null,null,null,null,null,null,null,"Fin Year:",{"$f":"INDEX(X19:X33,X35,1)","v":2018}]
[]
[null,null,null,null,null,null,null,null,null,null,null,null,null,null,null,null,null,null,null,null,null,null,null,{"$f":"MTREF&\"/\"&RIGHT(MTREF,2)+1","v":"2018/19"}]

{"sheet":"Template names","index":2,"n_rows":101,"n_cols":6,"rows_kept":101,"cut":false,"hidden":true,"merged":[[0,0,0,3],[61,0,61,3],[65,0,65,1]]}
["Common sheet headings"]
["Head1",{"$f":"HLOOKUP(MTREF,Headings,2)","v":"2017/18"},"Prior year -1"]
["Head1A",{"$f":"HLOOKUP(MTREF,Headings,3)","v":"2016/17"},"Prior year -2"]
["Head1B",{"$f":"HLOOKUP(MTREF,Headings,4)","v":"2015/16"},"Prior year -3"]
["Head2",{"$f":"HLOOKUP(MTREF,Headings,7)","v":"Budget Year 2018/19"},"Year of approved budget"]
["Head2A",{"$f":"HLOOKUP(MTREF,Headings,6)","v":"2018/19"},"Approved budget year"]
["Head3",{"$f":"HLOOKUP(MTREF,Headings,5)","v":"2018/19 Medium Term Revenue & Expenditure Framework"},"MTREF header name"]
["Head3A","Medium Term Revenue and Expenditure Framework"]
["Head4","Current year"]
["Head5","Audited Outcome"]
["Head5A","Outcome"]
["Head5B","Pre-audit outcome"]
["Head6","Original Budget"]
["Head7","Adjusted Budget"]
["Head8","Full Year Forecast"]
["Head9",{"$f":"HLOOKUP(MTREF,Headings,7)","v":"Budget Year 2018/19"},"1st year of MTREF","Year1"]
["Head10",{"$f":"HLOOKUP(MTREF,Headings,8)","v":"Budget Year +1 2019/20"},"2nd year of MTREF","Year2"]
["Head11",{"$f":"HLOOKUP(MTREF,Headings,9)","v":"Budget Year +2 2020/21"},"3rd year of MTREF","Year3"]
["Head24","Description",null,"Desc"]
["Head26","Vote Description",null,"VDesc"]
["Head27","Ref"]
["Head27a","References"]
["Head28","Surplus/ (Deficit) for the year",null,"Result"]
["Head29","Annual target 2007/08"]
["Head30","Revised target 2007/08"]
["Head31","Quarter ended 30 September"]
["Head32","Quarter ended 31 December"]
["Head33","Quarter ended 31 March"]
["Head34","Quarter ended 30 June"]
["Head35","Variance explanation"]
["Head36","YTD  Actual 31 Dec"]
["Head37","YTD  Budget 31 Dec"]
["Head38","Monthly actual"]
["Head39","YearTD actual"]
["Head40","YearTD budget"]
["Head41","YTD variance"]
["Head42","Surplus/ (Deficit) for the yr/period"]
["Head43",{"$f":"Head3&\" Summary\"","v":"2018/19 Medium Term Revenue & Expenditure Framework Summary"}]
["Head44","2001 Census"]
["Head45","2011 Census"]
["Head46"," - Adjustments Budget - January 2007"]
["Head47","Previous target year to complete"]
["Head48","Present value"]
["Head49"]
["Head50","Other Adjusts."]
["Head51","Accum. Funds"]
["Head52","Multi-year capital"]
["Head53","Unfore. Unavoid."]
["Head54","Prior Adjusted"]
["Head55","Nat. or Prov. Govt"]
["Head56","Total Adjusts."]
["Head57","Month DD, YYYY - "]
["Head58","Parent muni."]
["Head59","Downward adjusts"]
["SFPerf1","Budgeted Financial Performance"]
["SFPerf2","Forecast Financial Performance"]
["SFPos1","Budgeted Financial Position"]
["SFPos2","Forecast Financial Position"]
["Cash1","Budget Cash Flow"]
["Cash2","Forecast Cash Flow"]
["RandM","Expenditure includes repairs & maintenance of R'000"]
["Standard nomenclature"]
["Muni",{"$f":"'Lookup and lists'!B28","v":"LIM332 Greater Letaba"}]
["Municipal Entities",2,"Type of report:",1]
[{"$f":"IF((MuniEntities=1)*(MuniType=2),\"YES\",\"NO\")","v":"NO"},"Does this municipality have entities (consolidated budget and entity budgets required)? YES/NO"]
["Mid Year Review/Adjustment Budget schedules & tables",null,null,null,"Consolidated header","Parent municipality header"]
["ADJSum",{"$f":"D67&IF(Consolques=\"YES\",E67,F67)","v":"Table B1 Adjustments Budget Summary"},null,"Table B1 ",{"$f":"\"Consolidated \"&F67","v":"Consolidated Adjustments Budget Summary"},{"$f":"\"Adjustments Budget Summary\"","v":"Adjustments Budget Summary"}]
["ADJ2","Table B3 Adjustments Budget Financial Performance (revenue and expenditure by municipal vote)",null,"Table B3 ",{"$f":"\"Consolidated \"&F68","v":"Consolidated Adjustments Budget Financial Performance (revenue and expenditure by municipal vote)"},{"$f":"\"Adjustments Budget Financial Performance (revenue and expenditure by municipal vote)\"","v":"Adjustments Budget Financial Performance (revenue and expenditure by municipal vote)"}]
["ADJ3","Table B2 Adjustments Budget Financial Performance (functional classification)",null,"Table B2 ","Consolidated Adjustments Budget Financial Performance (functional classification)",{"$f":"\"Adjustments Budget Financial Performance (functional classification)\"","v":"Adjustments Budget Financial Performance (functional classification)"}]
["ADJ4","Table B4 Adjustments Budget Financial Performance (revenue and expenditure)",null,"Table B4 ","Consolidated Adjustments Budget Financial Performance (revenue and expenditure)",{"$f":"\"Adjustments Budget Financial Performance (revenue and expenditure)\"","v":"Adjustments Budget Financial Performance (revenue and expenditure)"}]
["ADJ5","Table B5 Adjustments Capital Expenditure Budget by vote and funding",null,"Table B5 ","Consolidated Adjustments Capital Expenditure Budget by vote and funding",{"$f":"\"Adjustments Capital Expenditure Budget by vote and funding\"","v":"Adjustments Capital Expenditure Budget by vote and funding"}]
["ADJ6","Table B6 Adjustments Budget Financial Position",null,"Table B6 ","Consolidated Adjustments Budget Financial Position",{"$f":"\"Adjustments Budget Financial Position\"","v":"Adjustments Budget Financial Position"}]
["ADJ7","Table B7 Adjustments Budget Cash Flows",null,"Table B7 ","Consolidated Adjustments Budget Cash Flows",{"$f":"\"Adjustments Budget Cash Flows\"","v":"Adjustments Budget Cash Flows"}]
["ADJ8","Table B8 Cash backed reserves/accumulated surplus reconciliation",null,"Table B8 ","Consolidated Cash backed reserves/accumulated surplus reconciliation",{"$f":"\"Cash backed reserves/accumulated surplus reconciliation\"","v":"Cash backed reserves/accumulated surplus reconciliation"}]
["ADJ9","Table B9 Asset Management",null,"Table B9 ","Consolidated Asset Management",{"$f":"\"Asset Management\"","v":"Asset Management"}]
["ADJ10","Table B10 Basic service delivery measurement",null,"Table B10 ","Consolidated Basic service delivery measurement",{"$f":"\"Basic service delivery measurement\"","v":"Basic service delivery measurement"}]
["ADJB1","Supporting Table SB1 Supporting detail to 'Budgeted Financial Performance'",null,{"$f":"D101&\"Table SB1 \"","v":"Supporting Table SB1 "},"Consolidated Supporting detail to 'Budgeted Financial Performance'",{"$f":"\"Supporting detail to 'Budgeted Financial Performance'\"","v":"Supporting detail to 'Budgeted Financial Performance'"}]
["ADJB2","Supporting Table SB2 Supporting detail to 'Financial Position Budget'",null,{"$f":"D101&\"Table SB2 \"","v":"Supporting Table SB2 "},"Consolidated Supporting detail to 'Financial Position Budget'",{"$f":"\"Supporting detail to 'Financial Position Budget'\"","v":"Supporting detail to 'Financial Position Budget'"}]
["ADJB3","Supporting Table SB3 Adjustments to the SDBIP - performance objectives",null,{"$f":"D101&\"Table SB3 \"","v":"Supporting Table SB3 "},"Consolidated Adjustments to the SDBIP - performance objectives",{"$f":"\"Adjustments to the SDBIP - performance objectives\"","v":"Adjustments to the SDBIP - performance objectives"}]
["ADJB4","Supporting Table SB4 Adjustments to budgeted performance indicators and benchmarks",null,{"$f":"D101&\"Table SB4 \"","v":"Supporting Table SB4 "},"Consolidated Adjustments to budgeted performance indicators and benchmarks",{"$f":"\"Adjustments to budgeted performance indicators and benchmarks\"","v":"Adjustments to budgeted performance indicators and benchmarks"}]
["ADJB5","Supporting Table SB5 Adjustments Budget - social, economic and demographic statistics and assumptions",null,{"$f":"D101&\"Table SB5 \"","v":"Supporting Table SB5 "},"Consolidated Adjustments Budget - social, economic and demographic statistics and assumptions",{"$f":"\"Adjustments Budget - social, economic and demographic statistics and assumptions\"","v":"Adjustments Budget - social, economic and demographic statistics and assumptions"}]
["ADJB6","Supporting Table SB6 Adjustments Budget - funding measurement",null,{"$f":"D101&\"Table SB6 \"","v":"Supporting Table SB6 "},"Consolidated Adjustments Budget - funding measurement",{"$f":"\"Adjustments Budget - funding measurement\"","v":"Adjustments Budget - funding measurement"}]
["ADJB7","Supporting Table SB7 Adjustments Budget - transfers and grant receipts",null,{"$f":"D101&\"Table SB7 \"","v":"Supporting Table SB7 "},"Consolidated Adjustments Budget - transfers and grant receipts",{"$f":"\"Adjustments Budget - transfers and grant receipts\"","v":"Adjustments Budget - transfers and grant receipts"}]
["ADJB8","Supporting Table SB8 Adjustments Budget - expenditure on transfers and grant programme",null,{"$f":"D101&\"Table SB8 \"","v":"Supporting Table SB8 "},"Consolidated Adjustments Budget - expenditure on transfers and grant programme",{"$f":"\"Adjustments Budget - expenditure on transfers and grant programme\"","v":"Adjustments Budget - expenditure on transfers and grant programme"}]
["ADJB9","Supporting Table SB9 Adjustments Budget - reconciliation of transfers, grant receipts, and unspent funds",null,{"$f":"D101&\"Table SB9 \"","v":"Supporting Table SB9 "},"Consolidated Adjustments Budget - reconciliation of transfers, grant receipts, and unspent funds",{"$f":"\"Adjustments Budget - reconciliation of transfers, grant receipts, and unspent funds\"","v":"Adjustments Budget - reconciliation of transfers, grant receipts, and unspent funds"}]
["ADJB10","Supporting Table SB10 Adjustments Budget - transfers and grants made by the municipality",null,{"$f":"D101&\"Table SB10 \"","v":"Supporting Table SB10 "},"Consolidated Adjustments Budget - transfers and grants made by the municipality",{"$f":"\"Adjustments Budget - transfers and grants made by the municipality\"","v":"Adjustments Budget - transfers and grants made by the municipality"}]
["ADJB11","Supporting Table SB11 Adjustments Budget - councillor and staff benefits",null,{"$f":"D101&\"Table SB11 \"","v":"Supporting Table SB11 "},"Consolidated Adjustments Budget - councillor and staff benefits",{"$f":"\"Adjustments Budget - councillor and staff benefits\"","v":"Adjustments Budget - councillor and staff benefits"}]
["ADJB12","Supporting Table SB12 Adjustments Budget - monthly revenue and expenditure (municipal vote)",null,{"$f":"D101&\"Table SB12 \"","v":"Supporting Table SB12 "},"Consolidated Adjustments Budget - monthly revenue and expenditure (municipal vote)",{"$f":"\"Adjustments Budget - monthly revenue and expenditure (municipal vote)\"","v":"Adjustments Budget - monthly revenue and expenditure (municipal vote)"}]
["ADJB13","Supporting Table SB13 Adjustments Budget - monthly revenue and expenditure (functional classification)",null,{"$f":"D101&\"Table SB13 \"","v":"Supporting Table SB13 "},"Consolidated Adjustments Budget - monthly revenue and expenditure (functional classification)",{"$f":"\"Adjustments Budget - monthly revenue and expenditure (functional classification)\"","v":"Adjustments Budget - monthly revenue and expenditure (functional classification)"}]
["ADJB14","Supporting Table SB14 Adjustments Budget - monthly revenue and expenditure",null,{"$f":"D101&\"Table SB14 \"","v":"Supporting Table SB14 "},"Consolidated Adjustments Budget - monthly revenue and expenditure",{"$f":"\"Adjustments Budget - monthly revenue and expenditure\"","v":"Adjustments Budget - monthly revenue and expenditure"}]
["ADJB15","Supporting Table SB15 Adjustments Budget - monthly cash flow",null,{"$f":"D101&\"Table SB15 \"","v":"Supporting Table SB15 "},"Consolidated Adjustments Budget - monthly cash flow",{"$f":"\"Adjustments Budget - monthly cash flow\"","v":"Adjustments Budget - monthly cash flow"}]
["ADJB16","Supporting Table SB16 Adjustments Budget - monthly capital expenditure (municipal vote)",null,{"$f":"D101&\"Table SB16 \"","v":"Supporting Table SB16 "},"Consolidated Adjustments Budget - monthly capital expenditure (municipal vote)",{"$f":"\"Adjustments Budget - monthly capital expenditure (municipal vote)\"","v":"Adjustments Budget - monthly capital expenditure (municipal vote)"}]
["ADJB17","Supporting Table SB17 Adjustments Budget - monthly capital expenditure (functional classification)",null,{"$f":"D101&\"Table SB17 \"","v":"Supporting Table SB17 "},"Consolidated Adjustments Budget - monthly capital expenditure (functional classification)",{"$f":"\"Adjustments Budget - monthly capital expenditure (functional classification)\"","v":"Adjustments Budget - monthly capital expenditure (functional classification)"}]
["ADJB18a","Supporting Table SB18a Adjustments Budget - capital expenditure on new assets by asset class",null,{"$f":"D101&\"Table SB18a \"","v":"Supporting Table SB18a "},"Consolidated Adjustments Budget - capital expenditure on new assets by asset class",{"$f":"\"Adjustments Budget - capital expenditure on new assets by asset class\"","v":"Adjustments Budget - capital expenditure on new assets by asset class"}]
["ADJB18b","Supporting Table SB18b Adjustments Budget - capital expenditure on renewal of existing assets by asset class",null,{"$f":"D101&\"Table SB18b \"","v":"Supporting Table SB18b "},{"$f":"\"Consolidated \"&F95","v":"Consolidated Adjustments Budget - capital expenditure on renewal of existing assets by asset class"},{"$f":"\"Adjustments Budget - capital expenditure on renewal of existing assets by asset class\"","v":"Adjustments Budget - capital expenditure on renewal of existing assets by asset class"}]
["ADJB18c","Supporting Table SB18c Adjustments Budget - expenditure on repairs and maintenance by asset class",null,{"$f":"D101&\"Table SB18c \"","v":"Supporting Table SB18c "},{"$f":"\"Consolidated \"&F96","v":"Consolidated Adjustments Budget - expenditure on repairs and maintenance by asset class"},{"$f":"\"Adjustments Budget - expenditure on repairs and maintenance by asset class\"","v":"Adjustments Budget - expenditure on repairs and maintenance by asset class"}]
["ADJB18d","Supporting Table SB18d Adjustments Budget - depreciation by asset class",null,{"$f":"D101&\"Table SB18d \"","v":"Supporting Table SB18d "},{"$f":"\"Consolidated \"&F97","v":"Consolidated Adjustments Budget - depreciation by asset class"},{"$f":"\"Adjustments Budget - depreciation by asset class\"","v":"Adjustments Budget - depreciation by asset class"}]
["ADJB18e","Supporting Table SB18d Adjustments Budget - capital expenditure on upgrading of existing assets by asset class",null,{"$f":"D101&\"Table SB18d \"","v":"Supporting Table SB18d "},{"$f":"\"Consolidated \"&F98","v":"Consolidated Adjustments Budget - capital expenditure on upgrading of existing assets by asset class"},{"$f":"\"Adjustments Budget - capital expenditure on upgrading of existing assets by asset class\"","v":"Adjustments Budget - capital expenditure on upgrading of existing assets by asset class"}]
["ADJB19","Supporting Table SB19 List of capital programmes and projects affected by Adjustments Budget",null,{"$f":"D101&\"Table SB19 \"","v":"Supporting Table SB19 "},"Consolidated List of capital programmes and projects affected by Adjustments Budget",{"$f":"\"List of capital programmes and projects affected by Adjustments Budget\"","v":"List of capital programmes and projects affected by Adjustments Budget"}]
["ADJB20","Supporting Table SB20 Not required",null,{"$f":"D101&\"Table SB20 \"","v":"Supporting Table SB20 "},{"$f":"\"Adjusted Budget Municipal Entity Performance Summary\"","v":"Adjusted Budget Municipal Entity Performance Summary"},"Not required"]
[null,null,null,"Supporting "]

{"sheet":"Lookup and lists","index":3,"n_rows":308,"n_cols":22,"rows_kept":308,"cut":false,"hidden":true,"merged":[]}
["Description",2007,2008,2009,2010,2011,2012,2013,2014,2015,2016,2017,2018,2019,2020,null,"Grants:","National - opex","Provincial - opex","National - capex","Provincial - capex","YESNO"]
[{"$f":"'Template names'!C2","v":"Prior year -1"},"2006/07","2007/08","2008/09",{"$f":"E1-1&\"/\"&RIGHT(E1,2)-0","v":"2009/10"},"2010/11","2011/12","2012/13","2013/14","2014/15","2015/16","2016/17","2017/18","2018/19","2019/20",null,null,"Local Government Equitable Share","Health subsidy"," Municipal Infrastructure Grant (MIG)","Agriculture","Yes"]
[{"$f":"'Template names'!C3","v":"Prior year -2"},"2005/06","2006/07","2007/08",{"$f":"E1-2&\"/\"&RIGHT(E1,2)-1","v":"2008/9"},"2009/10","2010/11","2011/12","2012/13","2013/14","2014/15","2015/16","2016/17","2017/18","2018/19",null,null,"RSC Levy Replacement ","Ambulance subsidy"," Public Transport and Systems","Education","No"]
[{"$f":"'Template names'!C4","v":"Prior year -3"},"2004/05","2005/06","2006/07",{"$f":"E1-3&\"/\"&RIGHT(E1,2)-2","v":"2007/8"},"2008/9","2009/10","2010/11","2011/12","2012/13","2013/14","2014/15","2015/16","2016/17","2017/18",null,null,"Finance Management ","Housing","Rural Transport Services and Infrastructure","Health"]
[{"$f":"'Template names'!C7","v":"MTREF header name"},"2007/08 Medium Term Revenue & Expenditure Framework","2008/09 Medium Term Revenue & Expenditure Framework","2009/10 Medium Term Revenue & Expenditure Framework",{"$f":"E1&\"/\"&RIGHT(E1,2)+1&\" Medium Term Revenue & Expenditure Framework\"","v":"2010/11 Medium Term Revenue & Expenditure Framework"},"2011/12 Medium Term Revenue & Expenditure Framework","2012/13 Medium Term Revenue & Expenditure Framework","2013/14 Medium Term Revenue & Expenditure Framework","2014/15 Medium Term Revenue & Expenditure Framework","2015/16 Medium Term Revenue & Expenditure Framework","2016/17 Medium Term Revenue & Expenditure Framework","2017/18 Medium Term Revenue & Expenditure Framework","2018/19 Medium Term Revenue & Expenditure Framework","2019/20 Medium Term Revenue & Expenditure Framework","2020/21 Medium Term Revenue & Expenditure Framework",null,null,"Municipal Systems Improvement","Sport and Recreation","Regional Bulk Infrastructure","Housing and Local Government "]
[{"$f":"'Template names'!C6","v":"Approved budget year"},"2007/08","2008/09","2009/10",{"$f":"E1&\"/\"&RIGHT(E1,2)+1","v":"2010/11"},"2011/12","2012/13","2013/14","2014/15","2015/16","2016/17","2017/18","2018/19","2019/20","2020/21",null,null,"Water Services Operating Subsidy ",null,"Rural Households Infrastructure ","Other Departments"]
[{"$f":"'Template names'!C16","v":"1st year of MTREF"},"Budget Year 2007/08","Budget Year 2008/09","Budget Year 2009/10",{"$f":"\"Budget Year \"&E1&\"/\"&RIGHT(E1,2)+1","v":"Budget Year 2010/11"},"Budget Year 2011/12","Budget Year 2012/13","Budget Year 2013/14","Budget Year 2014/15","Budget Year 2015/16","Budget Year 2016/17","Budget Year 2017/18","Budget Year 2018/19","Budget Year 2019/20","Budget Year 2020/21",null,null,"Energy Efficiency  and Demand Management",null,"Neighbourhood Development Partnership","Public Works, Roads, Transport "]
[{"$f":"'Template names'!C17","v":"2nd year of MTREF"},"Budget Year +1 2008/09","Budget Year +1 2009/10","Budget Year +1 2010/11",{"$f":"\"Budget Year +1 \"&E1+1&\"/\"&RIGHT(E1,2)+2","v":"Budget Year +1 2011/12"},"Budget Year +1 2012/13","Budget Year +1 2013/14","Budget Year +1 2014/15","Budget Year +1 2015/16","Budget Year +1 2016/17","Budget Year +1 2017/18","Budget Year +1 2018/19","Budget Year +1 2019/20","Budget Year +1 2020/21","Budget Year +1 2021/22",null,null,"Integrated National Electrification Programme",null,"2010 FIFA World Cup Stadiums Development","Sport and Recreation"]
[{"$f":"'Template names'!C18","v":"3rd year of MTREF"},"Budget Year +2 2009/10","Budget Year +2 2010/11","Budget Year +2 2011/12",{"$f":"\"Budget Year +2 \"&E1+2&\"/\"&RIGHT(E1,2)+3","v":"Budget Year +2 2012/13"},"Budget Year +2 2013/14","Budget Year +2 2014/15","Budget Year +2 2015/16","Budget Year +2 2016/17","Budget Year +2 2017/18","Budget Year +2 2018/19","Budget Year +2 2019/20","Budget Year +2 2020/21","Budget Year +2 2021/22","Budget Year +2 2022/23",null,null,"Municipal Drought Relief "]
["Adjustments Budget","Annual target 2007/08","Annual target 2008/09","Annual target 2009/10",{"$f":"\"Annual target \" & E1&\"/\"&RIGHT(E1,2)+1","v":"Annual target 2010/11"},"Annual target 2011/12","Annual target 2012/13","Annual target 2013/14","Annual target 2014/15","Annual target 2015/16","Annual target 2016/17","Annual target 2017/18","Annual target 2018/19","Annual target 2019/20","Annual target 2020/21",null,null,"2010 FIFA World Cup Operating"]
["NOTE: This sheet should not be directly amended - select headings from sheet 'S'",null,null,null,null,null,null,null,null,null,null,null,null,null,null,null,null,"Electricity Demand Side Management"]
[null,null,null,null,null,null,null,null,null,null,null,null,null,null,null,null,null,"EPWP Incentive"]
[]
[]
[null,null,null,null,null,null,null,null,null,null,null,null,null,null,null,null,null,"Asset Class","Asset sub-class Old","Asset sub-class","IUDF","MTSF"]
[]
[null,null,null,null,null,null,null,null,null,null,null,null,null,null,null,null,null,"Roads Infrastructure","Roads, Pavements & Bridges","Roads","Spatial integration","Quality basic education"]
[null,null,null,null,null,null,null,null,null,null,null,null,null,null,null,null,null,"Storm water Infrastructure","Storm water","Road Structures","Inclusion and access","A long and healthy life for all South Africans"]
[null,null,null,null,null,null,null,null,null,null,null,null,null,null,null,null,null,"Electrical Infrastructure","Generation","Road Furniture","Growth","All people in South Africa are and feel safe"]
[null,null,null,null,null,null,null,null,null,null,null,null,null,null,null,null,null,"Water Supply Infrastructure","Transmission & Reticulation","Capital Spares","Governance","Decent employment through inclusive growth"]
[null,null,null,null,null,null,null,null,null,null,null,null,null,null,null,null,null,"Sanitation Infrastructure","Street Lighting","Drainage Collection",null,"A skilled and capable workforce to support an inclusive growth path"]
[null,null,null,null,null,null,null,null,null,null,null,null,null,null,null,null,null,"Solid Waste Infrastructure","Dams & Reservoirs","Storm water Conveyance",null,"An efficient, competitive and responsive economic infrastructure network"]
[null,null,null,null,null,null,null,null,null,null,null,null,null,null,null,null,null,"Rail Infrastructure","Water purification","Attenuation",null,"Vibrant, equitable, sustainable rural communities contributing towards food security for all"]
[null,null,null,null,null,null,null,null,null,null,null,null,null,null,null,null,null,"Coastal Infrastructure","Reticulation","Power Plants",null,"Sustainable human settlements and improved quality of household life"]
[null,null,null,null,null,null,null,null,null,null,null,null,null,null,null,null,null,"Information and Communication Infrastructure","Sewerage purification","HV Substations",null,"Responsive, accountable, effective and efficient local government"]
[null,null,null,null,null,null,null,null,null,null,null,null,null,null,null,null,null,"Community Facilities","Waste Management","HV Switching Station",null,"Protect and enhance our environmental assets and natural resources"]
["Name link",130,null,null,null,null,null,null,null,null,null,null,null,null,null,null,null,"Sport and Recreation Facilities","Transportation","HV Transmission Conductors",null,"Create a better South Africa and contribute to a better Africa and a better world"]
["Name of Muni",{"$f":"INDEX(B29:B312,B27,1)","v":"LIM332 Greater Letaba"},null,null,null,null,null,null,null,null,null,null,null,null,null,null,null,"Heritage assets","Gas","MV Substations",null,"An efficient, effective and development-oriented public service"]
[null,"Choose name from list","Set name on 'Instructions' sheet",null,null,null,null,null,null,null,null,null,null,null,null,null,null,"Revenue Generating","Parks & gardens","MV Switching Stations",null,"A comprehensive, responsive and sustainable social protection system"]
[null,"BUF Buffalo City","Eastern Cape",null,null,null,null,null,null,null,null,null,null,null,null,null,null,"Non-revenue Generating","Sportsfields & stadia","MV Networks",null,"A diverse, socially cohesive society with a common national identity"]
[null,"NMA Nelson Mandela Bay","Eastern Cape",null,null,null,null,null,null,null,null,null,null,null,null,null,null,"Operational Buildings","Swimming pools","LV Networks"]
[null,"EC101 Dr. Beyers Naude","Eastern Cape",null,null,null,null,null,null,null,null,null,null,null,null,null,null,"Housing","Community halls","Capital Spares"]
[null,"EC102 Blue Crane Route","Eastern Cape",null,null,null,null,null,null,null,null,null,null,null,null,null,null,"Biological or Cultivated Assets","Libraries","Dams and Weirs"]
[null,"EC104 Makana","Eastern Cape",null,null,null,null,null,null,null,null,null,null,null,null,null,null,"Servitudes","Recreational facilities","Boreholes"]
[null,"EC105 Ndlambe","Eastern Cape",null,null,null,null,null,null,null,null,null,null,null,null,null,null,"Licences and Rights","Fire, safety & emergency","Reservoirs"]
[null,"EC106 Sundays River Valley","Eastern Cape",null,null,null,null,null,null,null,null,null,null,null,null,null,null,"Computer Equipment","Security and policing","Pump Stations"]
[null,"EC108 Kouga","Eastern Cape",null,null,null,null,null,null,null,null,null,null,null,null,null,null,"Furniture and Office Equipment","Buses","Water Treatment Works"]
[null,"EC109 Kou-Kamma","Eastern Cape",null,null,null,null,null,null,null,null,null,null,null,null,null,null,"Machinery and Equipment","Clinics","Bulk Mains"]
[null,"DC10 Sarah Baartman","Eastern Cape",null,null,null,null,null,null,null,null,null,null,null,null,null,null,"Transport Assets","Museums & Art Galleries","Distribution"]
[null,"EC121 Mbhashe","Eastern Cape",null,null,null,null,null,null,null,null,null,null,null,null,null,null,"Land","Cemeteries","Distribution Points"]
[null,"EC122 Mnquma","Eastern Cape",null,null,null,null,null,null,null,null,null,null,null,null,null,null,"Zoo's, Marine and Non-biological Animals","Social rental housing","PRV Stations"]
[null,"EC123 Great Kei","Eastern Cape",null,null,null,null,null,null,null,null,null,null,null,null,null,null,null,"Buildings","Capital Spares"]
[null,"EC124 Amahlathi","Eastern Cape",null,null,null,null,null,null,null,null,null,null,null,null,null,null,null,"Housing development","Pump Station"]
[null,"EC126 Ngqushwa","Eastern Cape",null,null,null,null,null,null,null,null,null,null,null,null,null,null,null,"General vehicles","Reticulation"]
[null,"EC129 Raymond Mhlaba","Eastern Cape",null,null,null,null,null,null,null,null,null,null,null,null,null,null,null,"Specialised vehicles - Refuse","Waste Water Treatment Works"]
[null,"DC12 Amathole","Eastern Cape",null,null,null,null,null,null,null,null,null,null,null,null,null,null,null,"Specialised vehicles - Fire","Outfall Sewers"]
[null,"EC131 Inxuba Yethemba","Eastern Cape",null,null,null,null,null,null,null,null,null,null,null,null,null,null,null,"Specialised vehicles - Conservancy","Toilet Facilities"]
[null,"EC135 Intsika Yethu","Eastern Cape",null,null,null,null,null,null,null,null,null,null,null,null,null,null,null,"Specialised vehicles - Ambulances","Capital Spares"]
[null,"EC136 Emalahleni (Ec)","Eastern Cape",null,null,null,null,null,null,null,null,null,null,null,null,null,null,null,"Plant & equipment","Landfill Sites"]
[null,"EC137 Engcobo","Eastern Cape",null,null,null,null,null,null,null,null,null,null,null,null,null,null,null,"Computers - hardware/equipment","Waste Transfer Stations"]
[null,"EC138 Sakhisizwe","Eastern Cape",null,null,null,null,null,null,null,null,null,null,null,null,null,null,null,"Furniture and other office equipment","Waste Processing Facilities"]
[null,"EC139 Enoch Mgijima","Eastern Cape",null,null,null,null,null,null,null,null,null,null,null,null,null,null,null,"Abattoirs","Waste Drop-off Points"]
[null,"DC13 Chris Hani","Eastern Cape",null,null,null,null,null,null,null,null,null,null,null,null,null,null,null,"Markets","Waste Separation Facilities"]
[null,"EC141 Elundini","Eastern Cape",null,null,null,null,null,null,null,null,null,null,null,null,null,null,null,"Civic Land and Buildings","Electricity Generation Facilities"]
[null,"EC142 Senqu","Eastern Cape",null,null,null,null,null,null,null,null,null,null,null,null,null,null,null,"Other Buildings","Capital Spares"]
[null,"EC145 Walter Sisulu","Eastern Cape",null,null,null,null,null,null,null,null,null,null,null,null,null,null,null,"Other Land","Rail Lines"]
[null,"DC14 Joe Gqabi","Eastern Cape",null,null,null,null,null,null,null,null,null,null,null,null,null,null,null,"Surplus Assets - (Investment or Inventory)","Rail Structures"]
[null,"EC153 Ngquza Hills","Eastern Cape",null,null,null,null,null,null,null,null,null,null,null,null,null,null,null,"Computers - software & programming","Rail Furniture"]
[null,"EC154 Port St Johns","Eastern Cape",null,null,null,null,null,null,null,null,null,null,null,null,null,null,null,"Other","Drainage Collection"]
[null,"EC155 Nyandeni","Eastern Cape",null,null,null,null,null,null,null,null,null,null,null,null,null,null,null,null,"Storm water Conveyance"]
[null,"EC156 Mhlontlo","Eastern Cape",null,null,null,null,null,null,null,null,null,null,null,null,null,null,"SB 19",null,"Attenuation"]
[null,"EC157 King Sabata Dalindyebo","Eastern Cape",null,null,null,null,null,null,null,null,null,null,null,null,null,null,"Yes",null,"MV Substations"]
[null,"DC15 O .R. Tambo","Eastern Cape",null,null,null,null,null,null,null,null,null,null,null,null,null,null,"No",null,"LV Networks"]
[null,"EC441 Matatiele","Eastern Cape",null,null,null,null,null,null,null,null,null,null,null,null,null,null,null,null,"Capital Spares"]
[null,"EC442 Umzimvubu","Eastern Cape",null,null,null,null,null,null,null,null,null,null,null,null,null,null,null,null,"Sand Pumps"]
[null,"EC443 Mbizana","Eastern Cape",null,null,null,null,null,null,null,null,null,null,null,null,null,null,null,null,"Piers"]
[null,"EC444 Ntabankulu","Eastern Cape",null,null,null,null,null,null,null,null,null,null,null,null,null,null,null,null,"Revetments"]
[null,"DC44 Alfred Nzo","Eastern Cape",null,null,null,null,null,null,null,null,null,null,null,null,null,null,null,null,"Promenades"]
[null,"MAN Mangaung","Free State",null,null,null,null,null,null,null,null,null,null,null,null,null,null,null,null,"Capital Spares"]
[null,"FS161 Letsemeng","Free State",null,null,null,null,null,null,null,null,null,null,null,null,null,null,null,null,"Data Centres"]
[null,"FS162 Kopanong","Free State",null,null,null,null,null,null,null,null,null,null,null,null,null,null,null,null,"Core Layers"]
[null,"FS163 Mohokare","Free State",null,null,null,null,null,null,null,null,null,null,null,null,null,null,null,null,"Distribution Layers"]
[null,"DC16 Xhariep","Free State",null,null,null,null,null,null,null,null,null,null,null,null,null,null,null,null,"Capital Spares"]
[null,"FS181 Masilonyana","Free State",null,null,null,null,null,null,null,null,null,null,null,null,null,null,null,null,"Halls"]
[null,"FS182 Tokologo","Free State",null,null,null,null,null,null,null,null,null,null,null,null,null,null,null,null,"Centres"]
[null,"FS183 Tswelopele","Free State",null,null,null,null,null,null,null,null,null,null,null,null,null,null,null,null,"Crèches"]
[null,"FS184 Matjhabeng","Free State",null,null,null,null,null,null,null,null,null,null,null,null,null,null,null,null,"Clinics/Care Centres"]
[null,"FS185 Nala","Free State",null,null,null,null,null,null,null,null,null,null,null,null,null,null,null,null,"Fire/Ambulance Stations"]
[null,"DC18 Lejweleputswa","Free State",null,null,null,null,null,null,null,null,null,null,null,null,null,null,null,null,"Testing Stations"]
[null,"FS191 Setsoto","Free State",null,null,null,null,null,null,null,null,null,null,null,null,null,null,null,null,"Museums"]
[null,"FS192 Dihlabeng","Free State",null,null,null,null,null,null,null,null,null,null,null,null,null,null,null,null,"Galleries"]
[null,"FS193 Nketoana","Free State",null,null,null,null,null,null,null,null,null,null,null,null,null,null,null,null,"Theatres"]
[null,"FS194 Maluti-a-Phofung","Free State",null,null,null,null,null,null,null,null,null,null,null,null,null,null,null,null,"Libraries"]
[null,"FS195 Phumelela","Free State",null,null,null,null,null,null,null,null,null,null,null,null,null,null,null,null,"Cemeteries/Crematoria"]
[null,"FS196 Mantsopa","Free State",null,null,null,null,null,null,null,null,null,null,null,null,null,null,null,null,"Police"]
[null,"DC19 Thabo Mofutsanyana","Free State",null,null,null,null,null,null,null,null,null,null,null,null,null,null,null,null,"Purls"]
[null,"FS201 Moqhaka","Free State",null,null,null,null,null,null,null,null,null,null,null,null,null,null,null,null,"Public Open Space"]
[null,"FS203 Ngwathe","Free State",null,null,null,null,null,null,null,null,null,null,null,null,null,null,null,null,"Nature Reserves"]
[null,"FS204 Metsimaholo","Free State",null,null,null,null,null,null,null,null,null,null,null,null,null,null,null,null,"Public Ablution Facilities"]
[null,"FS205 Mafube","Free State",null,null,null,null,null,null,null,null,null,null,null,null,null,null,null,null,"Markets"]
[null,"DC20 Fezile Dabi","Free State",null,null,null,null,null,null,null,null,null,null,null,null,null,null,null,null,"Stalls"]
[null,"EKU Ekurhuleni Metro","Gauteng",null,null,null,null,null,null,null,null,null,null,null,null,null,null,null,null,"Abattoirs"]
[null,"JHB City Of Johannesburg","Gauteng",null,null,null,null,null,null,null,null,null,null,null,null,null,null,null,null,"Airports"]
[null,"TSH City Of Tshwane","Gauteng",null,null,null,null,null,null,null,null,null,null,null,null,null,null,null,null,"Taxi Ranks/Bus Terminals"]
[null,"GT421 Emfuleni","Gauteng",null,null,null,null,null,null,null,null,null,null,null,null,null,null,null,null,"Capital Spares"]
[null,"GT422 Midvaal","Gauteng",null,null,null,null,null,null,null,null,null,null,null,null,null,null,null,null,"Indoor Facilities"]
[null,"GT423 Lesedi","Gauteng",null,null,null,null,null,null,null,null,null,null,null,null,null,null,null,null,"Outdoor Facilities"]
[null,"DC42 Sedibeng","Gauteng",null,null,null,null,null,null,null,null,null,null,null,null,null,null,null,null,"Capital Spares"]
[null,"GT481 Mogale City","Gauteng",null,null,null,null,null,null,null,null,null,null,null,null,null,null,null,null,"Monuments"]
[null,"GT484 Merafong City","Gauteng",null,null,null,null,null,null,null,null,null,null,null,null,null,null,null,null,"Historic Buildings"]
[null,"GT485 GT485","Gauteng",null,null,null,null,null,null,null,null,null,null,null,null,null,null,null,null,"Works of Art"]
[null,"DC48 West Rand","Gauteng",null,null,null,null,null,null,null,null,null,null,null,null,null,null,null,null,"Conservation Areas"]
[null,"ETH eThekwini","Kwazulu-Natal",null,null,null,null,null,null,null,null,null,null,null,null,null,null,null,null,"Other Heritage"]
[null,"KZN212 Umdoni","Kwazulu-Natal",null,null,null,null,null,null,null,null,null,null,null,null,null,null,null,null,"Improved Property"]
[null,"KZN213 Umzumbe","Kwazulu-Natal",null,null,null,null,null,null,null,null,null,null,null,null,null,null,null,null,"Unimproved Property"]
[null,"KZN214 uMuziwabantu","Kwazulu-Natal",null,null,null,null,null,null,null,null,null,null,null,null,null,null,null,null,"Municipal Offices"]
[null,"KZN216 Ray Nkonyeni","Kwazulu-Natal",null,null,null,null,null,null,null,null,null,null,null,null,null,null,null,null,"Pay/Enquiry Points"]
[null,"DC21 Ugu","Kwazulu-Natal",null,null,null,null,null,null,null,null,null,null,null,null,null,null,null,null,"Building Plan Offices"]
[null,"KZN221 uMshwathi","Kwazulu-Natal",null,null,null,null,null,null,null,null,null,null,null,null,null,null,null,null,"Workshops"]
[null,"KZN222 uMngeni","Kwazulu-Natal",null,null,null,null,null,null,null,null,null,null,null,null,null,null,null,null,"Yards"]
[null,"KZN223 Mpofana","Kwazulu-Natal",null,null,null,null,null,null,null,null,null,null,null,null,null,null,null,null,"Stores"]
[null,"KZN224 Impendle","Kwazulu-Natal",null,null,null,null,null,null,null,null,null,null,null,null,null,null,null,null,"Laboratories"]
[null,"KZN225 Msunduzi","Kwazulu-Natal",null,null,null,null,null,null,null,null,null,null,null,null,null,null,null,null,"Training Centres"]
[null,"KZN226 Mkhambathini","Kwazulu-Natal",null,null,null,null,null,null,null,null,null,null,null,null,null,null,null,null,"Manufacturing Plant"]
[null,"KZN227 Richmond","Kwazulu-Natal",null,null,null,null,null,null,null,null,null,null,null,null,null,null,null,null,"Depots"]
[null,"DC22 uMgungundlovu","Kwazulu-Natal",null,null,null,null,null,null,null,null,null,null,null,null,null,null,null,null,"Capital Spares"]
[null,"KZN235 Okhahlamba","Kwazulu-Natal",null,null,null,null,null,null,null,null,null,null,null,null,null,null,null,null,"Staff Housing"]
[null,"KZN237 Inkosi Langalibalele","Kwazulu-Natal",null,null,null,null,null,null,null,null,null,null,null,null,null,null,null,null,"Social Housing"]
[null,"KZN238 Alfred Duma","Kwazulu-Natal",null,null,null,null,null,null,null,null,null,null,null,null,null,null,null,null,"Capital Spares"]
[null,"DC23 Uthukela","Kwazulu-Natal",null,null,null,null,null,null,null,null,null,null,null,null,null,null,null,null,"Water Rights"]
[null,"KZN241 Endumeni","Kwazulu-Natal",null,null,null,null,null,null,null,null,null,null,null,null,null,null,null,null,"Effluent Licenses"]
[null,"KZN242 Nquthu","Kwazulu-Natal",null,null,null,null,null,null,null,null,null,null,null,null,null,null,null,null,"Solid Waste Licenses"]
[null,"KZN244 Msinga","Kwazulu-Natal",null,null,null,null,null,null,null,null,null,null,null,null,null,null,null,null,"Computer Software and Applications"]
[null,"KZN245 Umvoti","Kwazulu-Natal",null,null,null,null,null,null,null,null,null,null,null,null,null,null,null,null,"Load Settlement Software Applications"]
[null,"DC24 Umzinyathi","Kwazulu-Natal",null,null,null,null,null,null,null,null,null,null,null,null,null,null,null,null,"Unspecified"]
[null,"KZN252 Newcastle","Kwazulu-Natal"]
[null,"KZN253 eMadlangeni","Kwazulu-Natal"]
[null,"KZN254 Dannhauser","Kwazulu-Natal"]
[null,"DC25 Amajuba","Kwazulu-Natal"]
[null,"KZN261 eDumbe","Kwazulu-Natal"]
[null,"KZN262 uPhongolo","Kwazulu-Natal"]
[null,"KZN263 Abaqulusi","Kwazulu-Natal"]
[null,"KZN265 Nongoma","Kwazulu-Natal"]
[null,"KZN266 Ulundi","Kwazulu-Natal"]
[null,"DC26 Zululand","Kwazulu-Natal"]
[null,"KZN271 Umhlabuyalingana","Kwazulu-Natal"]
[null,"KZN272 Jozini","Kwazulu-Natal"]
[null,"KZN275 Mtubatuba","Kwazulu-Natal"]
[null,"KZN276 The New Big 5 False Bay","Kwazulu-Natal"]
[null,"DC27 Umkhanyakude","Kwazulu-Natal"]
[null,"KZN281 Mfolozi","Kwazulu-Natal"]
[null,"KZN282 uMhlathuze","Kwazulu-Natal"]
[null,"KZN284 uMlalazi","Kwazulu-Natal"]
[null,"KZN285 Mthonjaneni","Kwazulu-Natal"]
[null,"KZN286 Nkandla","Kwazulu-Natal"]
[null,"DC28 King Cetshwayo","Kwazulu-Natal"]
[null,"KZN291 Mandeni","Kwazulu-Natal"]
[null,"KZN292 KwaDukuza","Kwazulu-Natal"]
[null,"KZN293 Ndwedwe","Kwazulu-Natal"]
[null,"KZN294 Maphumulo","Kwazulu-Natal"]
[null,"DC29 iLembe","Kwazulu-Natal"]
[null,"KZN433 Greater Kokstad","Kwazulu-Natal"]
[null,"KZN434 Ubuhlebezwe","Kwazulu-Natal"]
[null,"KZN435 Umzimkhulu","Kwazulu-Natal"]
[null,"KZN436 Dr Nkosazana Dlamini Zuma","Kwazulu-Natal"]
[null,"DC43 Harry Gwala","Kwazulu-Natal"]
[null,"LIM331 Greater Giyani","Limpopo"]
[null,"LIM332 Greater Letaba","Limpopo"]
[null,"LIM333 Greater Tzaneen","Limpopo"]
[null,"LIM334 Ba-Phalaborwa","Limpopo"]
[null,"LIM335 Maruleng","Limpopo"]
[null,"DC33 Mopani","Limpopo"]
[null,"LIM341 Musina","Limpopo"]
[null,"LIM343 Thulamela","Limpopo"]
[null,"LIM344 Makhado","Limpopo"]
[null,"LIM345 LIM345","Limpopo"]
[null,"DC34 Vhembe","Limpopo"]
[null,"LIM351 Blouberg","Limpopo"]
[null,"LIM353 Molemole","Limpopo"]
[null,"LIM354 Polokwane","Limpopo"]
[null,"LIM355 Lepelle-Nkumpi","Limpopo"]
[null,"DC35 Capricorn","Limpopo"]
[null,"LIM361 Thabazimbi","Limpopo"]
[null,"LIM362 Lephalale","Limpopo"]
[null,"LIM366 Bela Bela","Limpopo"]
[null,"LIM367 Mogalakwena","Limpopo"]
[null,"LIM368 LIM368","Limpopo"]
[null,"DC36 Waterberg","Limpopo"]
[null,"LIM471 Ephraim Mogale","Limpopo"]
[null,"LIM472 Elias Motsoaledi","Limpopo"]
[null,"LIM473 Makhuduthamaga","Limpopo"]
[null,"LIM476 LIM476","Limpopo"]
[null,"DC47 Sekhukhune","Limpopo"]
[null,"MP301 Albert Luthuli","Mpumalanga"]
[null,"MP302 Msukaligwa","Mpumalanga"]
[null,"MP303 Mkhondo","Mpumalanga"]
[null,"MP304 Pixley Ka Seme (MP)","Mpumalanga"]
[null,"MP305 Lekwa","Mpumalanga"]
[null,"MP306 Dipaleseng","Mpumalanga"]
[null,"MP307 Govan Mbeki","Mpumalanga"]
[null,"DC30 Gert Sibande","Mpumalanga"]
[null,"MP311 Victor Khanye","Mpumalanga"]
[null,"MP312 Emalahleni (Mp)","Mpumalanga"]
[null,"MP313 Steve Tshwete","Mpumalanga"]
[null,"MP314 Emakhazeni","Mpumalanga"]
[null,"MP315 Thembisile Hani","Mpumalanga"]
[null,"MP316 Dr J.S. Moroka","Mpumalanga"]
[null,"DC31 Nkangala","Mpumalanga"]
[null,"MP321 Thaba Chweu","Mpumalanga"]
[null,"MP324 Nkomazi","Mpumalanga"]
[null,"MP325 Bushbuckridge","Mpumalanga"]
[null,"MP326 City of Mbombela","Mpumalanga"]
[null,"DC32 Ehlanzeni","Mpumalanga"]
[null,"NC451 Joe Morolong","Northern Cape"]
[null,"NC452 Ga-Segonyana","Northern Cape"]
[null,"NC453 Gamagara","Northern Cape"]
[null,"DC45 John Taolo Gaetsewe","Northern Cape"]
[null,"NC061 Richtersveld","Northern Cape"]
[null,"NC062 Nama Khoi","Northern Cape"]
[null,"NC064 Kamiesberg","Northern Cape"]
[null,"NC065 Hantam","Northern Cape"]
[null,"NC066 Karoo Hoogland","Northern Cape"]
[null,"NC067 Khai-Ma","Northern Cape"]
[null,"DC6 Namakwa","Northern Cape"]
[null,"NC071 Ubuntu","Northern Cape"]
[null,"NC072 Umsobomvu","Northern Cape"]
[null,"NC073 Emthanjeni","Northern Cape"]
[null,"NC074 Kareeberg","Northern Cape"]
[null,"NC075 Renosterberg","Northern Cape"]
[null,"NC076 Thembelihle","Northern Cape"]
[null,"NC077 Siyathemba","Northern Cape"]
[null,"NC078 Siyancuma","Northern Cape"]
[null,"DC7 Pixley Ka Seme (Nc)","Northern Cape"]
[null,"NC082 !Kai! Garib","Northern Cape"]
[null,"NC084 !Kheis","Northern Cape"]
[null,"NC085 Tsantsabane","Northern Cape"]
[null,"NC086 Kgatelopele","Northern Cape"]
[null,"NC087 Dawid Kuiper","Northern Cape"]
[null,"DC8 Z F Mgcawu","Northern Cape"]
[null,"NC091 Sol Plaatje","Northern Cape"]
[null,"NC092 Dikgatlong","Northern Cape"]
[null,"NC093 Magareng","Northern Cape"]
[null,"NC094 Phokwane","Northern Cape"]
[null,"DC9 Frances Baard","Northern Cape"]
[null,"NW371 Moretele","North West"]
[null,"NW372 Madibeng","North West"]
[null,"NW373 Rustenburg","North West"]
[null,"NW374 Kgetlengrivier","North West"]
[null,"NW375 Moses Kotane","North West"]
[null,"DC37 Bojanala Platinum","North West"]
[null,"NW381 Ratlou","North West"]
[null,"NW382 Tswaing","North West"]
[null,"NW383 Mafikeng","North West"]
[null,"NW384 Ditsobotla","North West"]
[null,"NW385 Ramotshere Moiloa","North West"]
[null,"DC38 Ngaka Modiri Molema","North West"]
[null,"NW392 Naledi (Nw)","North West"]
[null,"NW393 Mamusa","North West"]
[null,"NW394 Greater Taung","North West"]
[null,"NW396 Lekwa-Teemane","North West"]
[null,"NW397 Kagisano-Molopo","North West"]
[null,"DC39 Dr Ruth Segomotsi Mompati","North West"]
[null,"NW403 City Of Matlosana","North West"]
[null,"NW404 Maquassi Hills","North West"]
[null,"NW405 NW405","North West"]
[null,"DC40 Dr Kenneth Kaunda","North West"]
[null,"CPT Cape Town","Western Cape"]
[null,"WC011 Matzikama","Western Cape"]
[null,"WC012 Cederberg","Western Cape"]
[null,"WC013 Bergrivier","Western Cape"]
[null,"WC014 Saldanha Bay","Western Cape"]
[null,"WC015 Swartland","Western Cape"]
[null,"DC1 West Coast","Western Cape"]
[null,"WC022 Witzenberg","Western Cape"]
[null,"WC023 Drakenstein","Western Cape"]
[null,"WC024 Stellenbosch","Western Cape"]
[null,"WC025 Breede Valley","Western Cape"]
[null,"WC026 Langeberg","Western Cape"]
[null,"DC2 Cape Winelands DM","Western Cape"]
[null,"WC031 Theewaterskloof","Western Cape"]
[null,"WC032 Overstrand","Western Cape"]
[null,"WC033 Cape Agulhas","Western Cape"]
[null,"WC034 Swellendam","Western Cape"]
[null,"DC3 Overberg","Western Cape"]
[null,"WC041 Kannaland","Western Cape"]
[null,"WC042 Hessequa","Western Cape"]
[null,"WC043 Mossel Bay","Western Cape"]
[null,"WC044 George","Western Cape"]
[null,"WC045 Oudtshoorn","Western Cape"]
[null,"WC047 Bitou","Western Cape"]
[null,"WC048 Knysna","Western Cape"]
[null,"DC4 Eden","Western Cape"]
[null,"WC051 Laingsburg","Western Cape"]
[null,"WC052 Prince Albert","Western Cape"]
[null,"WC053 Beaufort West","Western Cape"]
[null,"DC5 Central Karoo","Western Cape"]
[]
[]
[]
[]
[]
[]
[]
[]
[]
[]
[]
[]
[]
[]
[]
[]
[]
[]
[]
[]
[]
[null,null,{"$f":"COUNTA(C30:C307)","v":257}]

{"sheet":"Org structure","index":4,"n_rows":166,"n_cols":5,"rows_kept":166,"cut":false,"hidden":false,"merged":[]}
["Organisational Structure Votes",null,"Organisational Structure Sub-Votes",null,"Display Sub-Votes"]
["Vote 1 - Executive & Council","Vote 1","Executive & Council"]
["Vote 2 - Finance and Administration",1.1000000000000001,"Mayor and Council",{"$f":"CONCATENATE(B3, \" - \", C3)","v":"1,1 - Mayor and Council"},"1,1 - Mayor and Council"]
["Vote 3 - Internal Audit",1.2,"Municipal Manager","1,2 - Municipal Manager","1,2 - Municipal Manager"]
["Vote 4 - Community and Public Safety",1.3,null,"1,3 - "]
["Vote 5 - Sports and Recreation",1.4,null,"1,4 - "]
["Vote 6 - Housing",1.5,null,"1,5 - "]
["Vote 7 - Planning and development ",1.6,null,"1,6 - "]
["Vote 8 - Road Transport",1.7,null,"1,7 - "]
["Vote 9 - Energy Sources",1.8,null,"1,8 - "]
["Vote 10 - Waste Water Management",1.9,null,"1,9 - "]
["Vote 11 - Waste Management","1.10",null,"1.10 - "]
[{"$f":"B123&\" - \"&C123","v":"Vote 12 - [NAME OF VOTE 12]"},"Vote 2","Finance and Administration"]
[{"$f":"B134&\" - \"&C134","v":"Vote 13 - [NAME OF VOTE 13]"},2.1,"Administrative and Corporate Support",{"$f":"CONCATENATE(B14, \" - \", C14)","v":"2,1 - Administrative and Corporate Support"},"2,1 - Administrative and Corporate Support"]
[{"$f":"B145&\" - \"&C145","v":"Vote 14 - [NAME OF VOTE 14]"},2.2000000000000002,"Asset Management","2,2 - Asset Management","2,2 - Asset Management"]
[{"$f":"B156&\" - \"&C156","v":"Vote 15 - [NAME OF VOTE 15]"},2.2999999999999998,"Budget and Treasury Office","2,3 - Budget and Treasury Office","2,3 - Budget and Treasury Office"]
[null,2.4,"Human Resource","2,4 - Human Resource","2,4 - Human Resource"]
[null,2.5,"Information Technology","2,5 - Information Technology","2,5 - Information Technology"]
[null,2.6,"Legal Services","2,6 - Legal Services","2,6 - Legal Services"]
[null,2.7,"Customer Relation and Coordination","2,7 - Customer Relation and Coordination","2,7 - Customer Relation and Coordination"]
[null,2.8,"Property Services","2,8 - Property Services","2,8 - Property Services"]
[null,2.9,"Risk Management","2,9 - Risk Management","2,9 - Risk Management"]
[null,"2.10","Supply Chain Management","2.10 - Supply Chain Management","2.10 - Supply Chain Management"]
[null,"Vote 3","Internal Audit"]
[null,3.1,"Governance Function",{"$f":"CONCATENATE(B25, \" - \", C25)","v":"3,1 - Governance Function"},"3,1 - Governance Function"]
[null,3.2,null,"3,2 - "]
[null,3.3,null,"3,3 - "]
[null,3.4,null,"3,4 - "]
[null,3.5,null,"3,5 - "]
[null,3.6,null,"3,6 - "]
[null,3.7,null,"3,7 - "]
[null,3.8,null,"3,8 - "]
[null,3.9,null,"3,9 - "]
[null,"3.10",null,"3.10 - "]
[null,"Vote 4","Community and Public Safety"]
[null,4.0999999999999996,"Cemetries and crematoriums",{"$f":"CONCATENATE(B36, \" - \", C36)","v":"4,1 - Cemetries and crematoriums"},"4,1 - Cemetries and crematoriums"]
[null,4.2,"Community halls and Facilities","4,2 - Community halls and Facilities","4,2 - Community halls and Facilities"]
[null,4.3,"Disaster Management","4,3 - Disaster Management","4,3 - Disaster Management"]
[null,4.4000000000000004,"Libraries and Archives","4,4 - Libraries and Archives","4,4 - Libraries and Archives"]
[null,4.5,null,"4,5 - "]
[null,4.5999999999999996,null,"4,6 - "]
[null,4.7,null,"4,7 - "]
[null,4.8,null,"4,8 - "]
[null,4.9000000000000004,null,"4,9 - "]
[null,"4.10",null,"4.10 - "]
[null,"Vote 5","Sports and Recreation"]
[null,5.0999999999999996,"Community parks",{"$f":"CONCATENATE(B47, \" - \", C47)","v":"5,1 - Community parks"},"5,1 - Community parks"]
[null,5.2,null,"5,2 - "]
[null,5.3,null,"5,3 - "]
[null,5.4,null,"5,4 - "]
[null,5.5,null,"5,5 - "]
[null,5.6,null,"5,6 - "]
[null,5.7,null,"5,7 - "]
[null,5.8,null,"5,8 - "]
[null,5.9,null,"5,9 - "]
[null,"5.10",null,"5.10 - "]
[null,"Vote 6","Housing"]
[null,6.1,"Housing",{"$f":"CONCATENATE(B58, \" - \", C58)","v":"6,1 - Housing"},"6,1 - Housing"]
[null,6.2,null,"6,2 - "]
[null,6.3,null,"6,3 - "]
[null,6.4,null,"6,4 - "]
[null,6.5,null,"6,5 - "]
[null,6.6,null,"6,6 - "]
[null,6.7,null,"6,7 - "]
[null,6.8,null,"6,8 - "]
[null,6.9,null,"6,9 - "]
[null,"6.10",null,"6.10 - "]
[null,"Vote 7","Planning and development "]
[null,7.1,"Corporate Wide Strategic Planning (IDP & LED)",{"$f":"CONCATENATE(B69, \" - \", C69)","v":"7,1 - Corporate Wide Strategic Planning (IDP & LED)"},"7,1 - Corporate Wide Strategic Planning (IDP & LED)"]
[null,7.2,"Town Planning and Building Regulations","7,2 - Town Planning and Building Regulations","7,2 - Town Planning and Building Regulations"]
[null,7.3,"Project Management Unit","7,3 - Project Management Unit","7,3 - Project Management Unit"]
[null,7.4,null,"7,4 - "]
[null,7.5,null,"7,5 - "]
[null,7.6,null,"7,6 - "]
[null,7.7,null,"7,7 - "]
[null,7.8,null,"7,8 - "]
[null,7.9,null,"7,9 - "]
[null,"7.10",null,"7.10 - "]
[null,"Vote 8","Road Transport"]
[null,8.1,"Road and Traffic Regulations",{"$f":"CONCATENATE(B80, \" - \", C80)","v":"8,1 - Road and Traffic Regulations"},"8,1 - Road and Traffic Regulations"]
[null,8.1999999999999993,"Roads","8,2 - Roads","8,2 - Roads"]
[null,8.3000000000000007,"Taxi Ranks","8,3 - Taxi Ranks","8,3 - Taxi Ranks"]
[null,8.4,null,"8,4 - "]
[null,8.5,null,"8,5 - "]
[null,8.6,null,"8,6 - "]
[null,8.6999999999999993,null,"8,7 - "]
[null,8.8000000000000007,null,"8,8 - "]
[null,8.9,null,"8,9 - "]
[null,"8.10",null,"8.10 - "]
[null,"Vote 9","Energy Sources"]
[null,9.1,"Electricity",{"$f":"CONCATENATE(B91, \" - \", C91)","v":"9,1 - Electricity"},"9,1 - Electricity"]
[null,9.1999999999999993,"Street Lighting","9,2 - Street Lighting","9,2 - Street Lighting"]
[null,9.3000000000000007,null,"9,3 - "]
[null,9.4,null,"9,4 - "]
[null,9.5,null,"9,5 - "]
[null,9.6,null,"9,6 - "]
[null,9.6999999999999993,null,"9,7 - "]
[null,9.8000000000000007,null,"9,8 - "]
[null,9.9,null,"9,9 - "]
[null,"9.10",null,"9.10 - "]
[null,"Vote 10","Waste Water Management"]
[null,10.1,"Public Toilets",{"$f":"CONCATENATE(B102, \" - \", C102)","v":"10,1 - Public Toilets"},"10,1 - Public Toilets"]
[null,10.199999999999999,null,"10,2 - "]
[null,10.3,null,"10,3 - "]
[null,10.4,null,"10,4 - "]
[null,10.5,null,"10,5 - "]
[null,10.6,null,"10,6 - "]
[null,10.7,null,"10,7 - "]
[null,10.8,null,"10,8 - "]
[null,10.9,null,"10,9 - "]
[null,"10.10",null,"10.10 - "]
[null,"Vote 11","Waste Management"]
[null,11.1,"Solid Waste Removal",{"$f":"CONCATENATE(B113, \" - \", C113)","v":"11,1 - Solid Waste Removal"},"11,1 - Solid Waste Removal"]
[null,11.2,null,"11,2 - "]
[null,11.3,null,"11,3 - "]
[null,11.4,null,"11,4 - "]
[null,11.5,null,"11,5 - "]
[null,11.6,null,"11,6 - "]
[null,11.7,null,"11,7 - "]
[null,11.8,null,"11,8 - "]
[null,11.9,null,"11,9 - "]
[null,"11.10",null,"11.10 - "]
[null,"Vote 12","[NAME OF VOTE 12]"]
[null,12.1,"[Name of sub-vote]",{"$f":"CONCATENATE(B124, \" - \", C124)","v":"12,1 - [Name of sub-vote]"},"12.1 - [Name of sub-vote]"]
[null,12.2,"[Name of sub-vote]","12,2 - [Name of sub-vote]"]
[null,12.3,"[Name of sub-vote]","12,3 - [Name of sub-vote]"]
[null,12.4,"[Name of sub-vote]","12,4 - [Name of sub-vote]"]
[null,12.5,"[Name of sub-vote]","12,5 - [Name of sub-vote]"]
[null,12.6,"[Name of sub-vote]","12,6 - [Name of sub-vote]"]
[null,12.7,"[Name of sub-vote]","12,7 - [Name of sub-vote]"]
[null,12.8,"[Name of sub-vote]","12,8 - [Name of sub-vote]"]
[null,12.9,"[Name of sub-vote]","12,9 - [Name of sub-vote]"]
[null,"12.10","[Name of sub-vote]","12.10 - [Name of sub-vote]"]
[null,"Vote 13","[NAME OF VOTE 13]"]
[null,13.1,"[Name of sub-vote]",{"$f":"CONCATENATE(B135, \" - \", C135)","v":"13,1 - [Name of sub-vote]"},"13.1 - [Name of sub-vote]"]
[null,13.2,"[Name of sub-vote]","13,2 - [Name of sub-vote]"]
[null,13.3,"[Name of sub-vote]","13,3 - [Name of sub-vote]"]
[null,13.4,"[Name of sub-vote]","13,4 - [Name of sub-vote]"]
[null,13.5,"[Name of sub-vote]","13,5 - [Name of sub-vote]"]
[null,13.6,"[Name of sub-vote]","13,6 - [Name of sub-vote]"]
[null,13.7,"[Name of sub-vote]","13,7 - [Name of sub-vote]"]
[null,13.8,"[Name of sub-vote]","13,8 - [Name of sub-vote]"]
[null,13.9,"[Name of sub-vote]","13,9 - [Name of sub-vote]"]
[null,"13.10","[Name of sub-vote]","13.10 - [Name of sub-vote]"]
[null,"Vote 14","[NAME OF VOTE 14]"]
[null,14.1,"[Name of sub-vote]",{"$f":"CONCATENATE(B146, \" - \", C146)","v":"14,1 - [Name of sub-vote]"},"14.1 - [Name of sub-vote]"]
[null,14.2,"[Name of sub-vote]","14,2 - [Name of sub-vote]"]
[null,14.3,"[Name of sub-vote]","14,3 - [Name of sub-vote]"]
[null,14.4,"[Name of sub-vote]","14,4 - [Name of sub-vote]"]
[null,14.5,"[Name of sub-vote]","14,5 - [Name of sub-vote]"]
[null,14.6,"[Name of sub-vote]","14,6 - [Name of sub-vote]"]
[null,14.7,"[Name of sub-vote]","14,7 - [Name of sub-vote]"]
[null,14.8,"[Name of sub-vote]","14,8 - [Name of sub-vote]"]
[null,14.9,"[Name of sub-vote]","14,9 - [Name of sub-vote]"]
[null,"14.10","[Name of sub-vote]","14.10 - [Name of sub-vote]"]
[null,"Vote 15","[NAME OF VOTE 15]"]
[null,15.1,"[Name of sub-vote]",{"$f":"CONCATENATE(B157, \" - \", C157)","v":"15,1 - [Name of sub-vote]"},"15.1 - [Name of sub-vote]"]
[null,15.2,"[Name of sub-vote]","15,2 - [Name of sub-vote]"]
[null,15.3,"[Name of sub-vote]","15,3 - [Name of sub-vote]"]
[null,15.4,"[Name of sub-vote]","15,4 - [Name of sub-vote]"]
[null,15.5,"[Name of sub-vote]","15,5 - [Name of sub-vote]"]
[null,15.6,"[Name of sub-vote]","15,6 - [Name of sub-vote]"]
[null,15.7,"[Name of sub-vote]","15,7 - [Name of sub-vote]"]
[null,15.8,"[Name of sub-vote]","15,8 - [Name of sub-vote]"]
[null,15.9,"[Name of sub-vote]","15,9 - [Name of sub-vote]"]
[null,"15.10","[Name of sub-vote]","15.10 - [Name of sub-vote]"]

{"sheet":"Contacts","index":5,"n_rows":140,"n_cols":4,"rows_kept":140,"cut":false,"hidden":false,"merged":[[92,0,92,1],[92,2,92,3],[124,0,124,1],[124,2,124,3],[132,0,132,1],[132,2,132,3],[100,0,100,1],[100,2,100,3],[108,0,108,1],[108,2,108,3],[116,0,116,1],[116,2,116,3],[67,2,67,3],[76,0,76,1],[76,2,76,3],[84,0,84,1],[84,2,84,3],[48,0,48,1],[48,2,48,3],[57,0,57,1],[57,2,57,3],[58,2,58,3],[30,2,30,3],[39,0,39,1],[7,2,7,3],[10,2,10,3],[12,2,12,3],[13,0,13,1],[29,0,29,1],[29,2,29,3],[39,2,39,3]]}
[{"$f":"'Template names'!$B$63&\" - \"&\" Contact Information\"","v":"LIM332 Greater Letaba -  Contact Information"}]
[]
["A. GENERAL INFORMATION"]
["Municipality",{"$f":"'Template names'!$B$63","v":"LIM332 Greater Letaba"},"Set name on 'Instructions' sheet"]
[]
["Grade",null,"1 Grade in terms of the Remuneration of Public Office Bearers Act."]
[]
["Province",{"$f":"IF(B4>\" \",VLOOKUP(B4,'Lookup and lists'!B29:C312,2, FALSE),\" \")","v":"Limpopo"}]
[]
["Web Address","www.greaterletaba.gov.za"]
[]
["e-mail Address"]
[]
["B. CONTACT INFORMATION"]
["Postal address:"]
["P.O. Box",36]
["City / Town","Modjadjiskloof"]
["Postal Code",835]
[]
["Street address"]
["Building","Civic Centre"]
["Street No. & Name","44 Botha Street"]
["City / Town","Modjadjiskloof"]
["Postal Code",835]
[]
["General Contacts"]
["Telephone number","015 309 9246/7/8"]
["Fax number","015 309 9419"]
[]
["C. POLITICAL LEADERSHIP"]
["Speaker:",null,"Secretary/PA to the Speaker:"]
["ID Number","6704290418087","ID Number","\"7305100539085"]
["Title","Ms","Title","Ms"]
["Name","Makhananisa M.D","Name","Mutshendze TM"]
["Telephone number","015 309 9246","Telephone number","015 309 9246"]
["Cell number","082 418 8635","Cell number","073 227 7640"]
["Fax number","015 309 9419","Fax number","015 309 9419"]
["E-mail address","speaker@glm.gov.za","E-mail address","mollym@glm.gov.za"]
[]
["Mayor/Executive Mayor:",null,"Secretary/PA to the Mayor/Executive Mayor:"]
["ID Number","\"6302025730080","ID Number","\"7905070311082"]
["Title","Mr","Title","Ms"]
["Name","Matlou M.P","Name","Maapolela D.W"]
["Telephone number","015 309 9246","Telephone number","015 309 9246"]
["Cell number","079 153 5627","Cell number","083 977 3072"]
["Fax number","015 309 9419","Fax number","015 309 9419"]
["E-mail address","mayor@glm.gov.za","E-mail address","nkelem@glm.gov.za"]
[]
["Deputy Mayor/Executive Mayor:",null,"Secretary/PA to the Deputy Mayor/Executive Mayor:"]
["ID Number",null,"ID Number"]
["Title",null,"Title"]
["Name",null,"Name"]
["Telephone number",null,"Telephone number"]
["Cell number",null,"Cell number"]
["Fax number",null,"Fax number"]
["E-mail address",null,"E-mail address"]
[]
["D. MANAGEMENT LEADERSHIP"]
["Municipal Manager:",null,"Secretary/PA to the Municipal Manager:"]
["ID Number","'7209095504080","ID Number","7212280485081"]
["Title","Mr","Title","Ms"]
["Name","Dr K.I Sirovha","Name","M.F Masipa"]
["Telephone number","015 309 9451","Telephone number","0153099246"]
["Cell number","0721239734","Cell number","0828440350"]
["Fax number","015 309 9419","Fax number","0153099419"]
["E-mail address","InnocentS@glm.gov.za","E-mail address","secretarymm@glm.gov.za"]
[]
["Chief Financial Officer",null,"Secretary/PA to the Chief Financial Officer"]
["ID Number","\"7211080336080","ID Number","\"8405280648083"]
["Title","Mrs","Title","Ms"]
["Name","Mankgabe M.F","Name","Mashatola M.C"]
["Telephone number","0153099246","Telephone number","015 309 9246"]
["Cell number","076 715 9510","Cell number","081 046 4536"]
["Fax number","0153099419","Fax number","015 309 9419"]
["E-mail address","mologil@webmail.co.za","E-mail address","mmachawelam@glm.gov.za"]
[]
["Official responsible for submitting financial information",null,"Official responsible for submitting financial information"]
["ID Number","\"8505230737082","ID Number","\"9006111065080"]
["Title","Ms","Title","Ms"]
["Name","Nomsa Makhubela","Name","Tracy Baloyi"]
["Telephone number","015 309 9246","Telephone number","015 309 9246"]
["Cell number","064 750 1437","Cell number","083 271 0762"]
["Fax number","015 309 9419","Fax number","015 309 9419"]
["E-mail address","nomsam@glm.gov.za","E-mail address","Tracyb@glm.gov.za"]
["Official responsible for submitting financial information",null,"Official responsible for submitting financial information"]
["ID Number",null,"ID Number"]
["Title","Mr","Title"]
["Name","Mamatlepa LM","Name"]
["Telephone number","015 309 9246","Telephone number"]
["Cell number","076 167 8941","Cell number"]
["Fax number","015 309 9419","Fax number"]
["E-mail address","lesleym@glm.gov.za","E-mail address"]
["Official responsible for submitting financial information",null,"Official responsible for submitting financial information"]
["ID Number",null,"ID Number"]
["Title",null,"Title"]
["Name",null,"Name"]
["Telephone number",null,"Telephone number"]
["Cell number",null,"Cell number"]
["Fax number",null,"Fax number"]
["E-mail address",null,"E-mail address"]
["Official responsible for submitting financial information",null,"Official responsible for submitting financial information"]
["ID Number",null,"ID Number"]
["Title",null,"Title"]
["Name",null,"Name"]
["Telephone number",null,"Telephone number"]
["Cell number",null,"Cell number"]
["Fax number",null,"Fax number"]
["E-mail address",null,"E-mail address"]
["Official responsible for submitting financial information",null,"Official responsible for submitting financial information"]
["ID Number",null,"ID Number"]
["Title",null,"Title"]
["Name",null,"Name"]
["Telephone number",null,"Telephone number"]
["Cell number",null,"Cell number"]
["Fax number",null,"Fax number"]
["E-mail address",null,"E-mail address"]
["Official responsible for submitting financial information",null,"Official responsible for submitting financial information"]
["ID Number",null,"ID Number"]
["Title",null,"Title"]
["Name",null,"Name"]
["Telephone number",null,"Telephone number"]
["Cell number",null,"Cell number"]
["Fax number",null,"Fax number"]
["E-mail address",null,"E-mail address"]
["Official responsible for submitting financial information",null,"Official responsible for submitting financial information"]
["ID Number",null,"ID Number"]
["Title",null,"Title"]
["Name",null,"Name"]
["Telephone number",null,"Telephone number"]
["Cell number",null,"Cell number"]
["Fax number",null,"Fax number"]
["E-mail address",null,"E-mail address"]
["Official responsible for submitting financial information"]
["ID Number"]
["Title"]
["Name"]
["Telephone number"]
["Cell number"]
["Fax number"]
["E-mail address"]

{"sheet":"B1-Sum","index":6,"n_rows":77,"n_cols":12,"rows_kept":77,"cut":false,"hidden":false,"merged":[[74,0,74,12],[76,0,76,12],[1,1,1,9],[1,0,3,0],[69,0,69,12],[70,0,70,12],[71,0,71,12],[72,0,72,12]]}
[{"$f":"muni&\" - \"&adjsum&\" - \"&Date","v":"LIM332 Greater Letaba - Table B1 Adjustments Budget Summary - 27 February 2019"}]
[{"$f":"desc","v":"Description"},{"$f":"Head2","v":"Budget Year 2018/19"},null,null,null,null,null,null,null,null,{"$f":"Head10","v":"Budget Year +1 2019/20"},{"$f":"Head11","v":"Budget Year +2 2020/21"}]
[null,{"$f":"Head6","v":"Original Budget"},{"$f":"Head54","v":"Prior Adjusted"},{"$f":"Head51","v":"Accum. Funds"},{"$f":"Head52","v":"Multi-year capital"},{"$f":"Head53","v":"Unfore. Unavoid."},{"$f":"Head55","v":"Nat. or Prov. Govt"},{"$f":"Head50","v":"Other Adjusts."},{"$f":"Head56","v":"Total Adjusts."},{"$f":"Head7","v":"Adjusted Budget"},{"$f":"Head7","v":"Adjusted Budget"},{"$f":"Head7","v":"Adjusted Budget"}]
[null,null,1,2,3,4,5,6,7,8]
["R thousands","A","A1","B","C","D","E","F","G","H"]
["Financial Performance"]
["Property rates",{"$f":"SUM('B4-FinPerf RE'!C7:C7)","v":12255327.57},{"$f":"SUM('B4-FinPerf RE'!D7:D7)","v":0},{"$f":"SUM('B4-FinPerf RE'!E7:E7)","v":0},{"$f":"SUM('B4-FinPerf RE'!F7:F7)","v":0},{"$f":"SUM('B4-FinPerf RE'!G7:G7)","v":0},{"$f":"SUM('B4-FinPerf RE'!H7:H7)","v":0},{"$f":"SUM('B4-FinPerf RE'!I7:I7)","v":4607959},{"$f":"SUM(D7:H7)","v":4607959},{"$f":"IF(C7=0,B7+I7,C7+I7)","v":16863286.57},{"$f":"SUM('B4-FinPerf RE'!L7:L7)","v":16894401},{"$f":"SUM('B4-FinPerf RE'!M7:M7)","v":17992537}]
["Service charges",{"$f":"SUM('B4-FinPerf RE'!C8:C12)","v":18902040.030000001},{"$f":"SUM('B4-FinPerf RE'!D8:D12)","v":0},{"$f":"SUM('B4-FinPerf RE'!E8:E12)","v":0},{"$f":"SUM('B4-FinPerf RE'!F8:F12)","v":0},{"$f":"SUM('B4-FinPerf RE'!G8:G12)","v":0},{"$f":"SUM('B4-FinPerf RE'!H8:H12)","v":0},{"$f":"SUM('B4-FinPerf RE'!I8:I12)","v":13808000},13808000,32710040.030000001,{"$f":"SUM('B4-FinPerf RE'!L8:L12)","v":31641193},{"$f":"SUM('B4-FinPerf RE'!M8:M12)","v":33697871}]
["Investment revenue",{"$f":"'B4-FinPerf RE'!C14","v":4519515.4400000004},{"$f":"'B4-FinPerf RE'!D14","v":0},{"$f":"'B4-FinPerf RE'!E14","v":0},{"$f":"'B4-FinPerf RE'!F14","v":0},{"$f":"'B4-FinPerf RE'!G14","v":0},{"$f":"'B4-FinPerf RE'!H14","v":0},{"$f":"'B4-FinPerf RE'!I14","v":0},0,4519515.4400000004,{"$f":"'B4-FinPerf RE'!L14","v":4813283},{"$f":"'B4-FinPerf RE'!M14","v":5126147}]
["Transfers recognised - operational",{"$f":"'B4-FinPerf RE'!C20","v":248358000},{"$f":"'B4-FinPerf RE'!D20","v":0},{"$f":"'B4-FinPerf RE'!E20","v":0},{"$f":"'B4-FinPerf RE'!F20","v":0},{"$f":"'B4-FinPerf RE'!G20","v":0},{"$f":"'B4-FinPerf RE'!H20","v":0},{"$f":"'B4-FinPerf RE'!I20","v":0},0,248358000,{"$f":"'B4-FinPerf RE'!L20","v":274109000},{"$f":"'B4-FinPerf RE'!M20","v":297262000}]
["Other own revenue",{"$f":"'B4-FinPerf RE'!C13+'B4-FinPerf RE'!C15+'B4-FinPerf RE'!C16+'B4-FinPerf RE'!C17+'B4-FinPerf RE'!C18+'B4-FinPerf RE'!C19+'B4-FinPerf RE'!C21+'B4-FinPerf RE'!C22","v":56221797.189999998},{"$f":"'B4-FinPerf RE'!D13+'B4-FinPerf RE'!D15+'B4-FinPerf RE'!D16+'B4-FinPerf RE'!D17+'B4-FinPerf RE'!D18+'B4-FinPerf RE'!D19+'B4-FinPerf RE'!D21+'B4-FinPerf RE'!D22","v":0},{"$f":"'B4-FinPerf RE'!E13+'B4-FinPerf RE'!E15+'B4-FinPerf RE'!E16+'B4-FinPerf RE'!E17+'B4-FinPerf RE'!E18+'B4-FinPerf RE'!E19+'B4-FinPerf RE'!E21+'B4-FinPerf RE'!E22","v":0},{"$f":"'B4-FinPerf RE'!F13+'B4-FinPerf RE'!F15+'B4-FinPerf RE'!F16+'B4-FinPerf RE'!F17+'B4-FinPerf RE'!F18+'B4-FinPerf RE'!F19+'B4-FinPerf RE'!F21+'B4-FinPerf RE'!F22","v":0},{"$f":"'B4-FinPerf RE'!G13+'B4-FinPerf RE'!G15+'B4-FinPerf RE'!G16+'B4-FinPerf RE'!G17+'B4-FinPerf RE'!G18+'B4-FinPerf RE'!G19+'B4-FinPerf RE'!G21+'B4-FinPerf RE'!G22","v":0},{"$f":"'B4-FinPerf RE'!H13+'B4-FinPerf RE'!H15+'B4-FinPerf RE'!H16+'B4-FinPerf RE'!H17+'B4-FinPerf RE'!H18+'B4-FinPerf RE'!H19+'B4-FinPerf RE'!H21+'B4-FinPerf RE'!H22","v":0},{"$f":"'B4-FinPerf RE'!I13+'B4-FinPerf RE'!I15+'B4-FinPerf RE'!I16+'B4-FinPerf RE'!I17+'B4-FinPerf RE'!I18+'B4-FinPerf RE'!I19+'B4-FinPerf RE'!I21+'B4-FinPerf RE'!I22","v":28009241},28009241,84231038.189999998,{"$f":"'B4-FinPerf RE'!L13+'B4-FinPerf RE'!L15+'B4-FinPerf RE'!L16+'B4-FinPerf RE'!L17+'B4-FinPerf RE'!L18+'B4-FinPerf RE'!L19+'B4-FinPerf RE'!L21+'B4-FinPerf RE'!L22","v":60535704},{"$f":"'B4-FinPerf RE'!M13+'B4-FinPerf RE'!M15+'B4-FinPerf RE'!M16+'B4-FinPerf RE'!M17+'B4-FinPerf RE'!M18+'B4-FinPerf RE'!M19+'B4-FinPerf RE'!M21+'B4-FinPerf RE'!M22","v":64470523}]
["Total Revenue (excluding capital transfers and contributions)",{"$f":"SUM(B7:B11)","v":340256680.23000002},0,0,0,0,0,46425200,46425200,386681880.23000002,387993581,418549078]
["Employee costs",{"$f":"'B4-FinPerf RE'!C26","v":78303797.25},{"$f":"'B4-FinPerf RE'!D26","v":0},{"$f":"'B4-FinPerf RE'!E26","v":0},{"$f":"'B4-FinPerf RE'!F26","v":0},{"$f":"'B4-FinPerf RE'!G26","v":0},{"$f":"'B4-FinPerf RE'!H26","v":0},{"$f":"'B4-FinPerf RE'!I26","v":16962495},{"$f":"SUM(D13:H13)","v":16962495},{"$f":"IF(C13=0,B13+I13,C13+I13)","v":95266292.25},{"$f":"'B4-FinPerf RE'!L26","v":101544882},{"$f":"'B4-FinPerf RE'!M26","v":108008806}]
["Remuneration of councillors",{"$f":"'B4-FinPerf RE'!C27","v":22467855},{"$f":"'B4-FinPerf RE'!D27","v":0},{"$f":"'B4-FinPerf RE'!E27","v":0},{"$f":"'B4-FinPerf RE'!F27","v":0},{"$f":"'B4-FinPerf RE'!G27","v":0},{"$f":"'B4-FinPerf RE'!H27","v":0},{"$f":"'B4-FinPerf RE'!I27","v":414177},414177,22882032,{"$f":"'B4-FinPerf RE'!L27","v":24369368},{"$f":"'B4-FinPerf RE'!M27","v":25953376}]
["Depreciation & asset impairment",{"$f":"'B4-FinPerf RE'!C29","v":5043379.8099999996},{"$f":"'B4-FinPerf RE'!D29","v":0},{"$f":"'B4-FinPerf RE'!E29","v":0},{"$f":"'B4-FinPerf RE'!F29","v":0},{"$f":"'B4-FinPerf RE'!G29","v":0},{"$f":"'B4-FinPerf RE'!H29","v":0},{"$f":"'B4-FinPerf RE'!I29","v":898831},898831,5942210.8099999996,{"$f":"'B4-FinPerf RE'!L29","v":6865248},{"$f":"'B4-FinPerf RE'!M29","v":7311489}]
["Finance charges",{"$f":"'B4-FinPerf RE'!C30","v":0},{"$f":"'B4-FinPerf RE'!D30","v":0},{"$f":"'B4-FinPerf RE'!E30","v":0},{"$f":"'B4-FinPerf RE'!F30","v":0},{"$f":"'B4-FinPerf RE'!G30","v":0},{"$f":"'B4-FinPerf RE'!H30","v":0},{"$f":"'B4-FinPerf RE'!I30","v":0},0,0,{"$f":"'B4-FinPerf RE'!L30","v":0},{"$f":"'B4-FinPerf RE'!M30","v":0}]
["Materials and bulk purchases",{"$f":"SUM('B4-FinPerf RE'!C31:C32)","v":17096559},{"$f":"SUM('B4-FinPerf RE'!D31:D32)","v":0},{"$f":"SUM('B4-FinPerf RE'!E31:E32)","v":0},{"$f":"SUM('B4-FinPerf RE'!F31:F32)","v":0},{"$f":"SUM('B4-FinPerf RE'!G31:G32)","v":0},{"$f":"SUM('B4-FinPerf RE'!H31:H32)","v":0},{"$f":"SUM('B4-FinPerf RE'!I31:I32)","v":0},0,17096559,{"$f":"SUM('B4-FinPerf RE'!L31:L32)","v":18207835},{"$f":"SUM('B4-FinPerf RE'!M31:M32)","v":19391344}]
["Transfers and grants",{"$f":"'B4-FinPerf RE'!C34","v":0},{"$f":"'B4-FinPerf RE'!D34","v":0},{"$f":"'B4-FinPerf RE'!E34","v":0},{"$f":"'B4-FinPerf RE'!F34","v":0},{"$f":"'B4-FinPerf RE'!G34","v":0},{"$f":"'B4-FinPerf RE'!H34","v":0},{"$f":"'B4-FinPerf RE'!I34","v":0},0,0,{"$f":"'B4-FinPerf RE'!L34","v":0},{"$f":"'B4-FinPerf RE'!M34","v":0}]
["Other expenditure",{"$f":"'B4-FinPerf RE'!C37-SUM('B1-Sum'!B13:B18)","v":100518770.30239999},{"$f":"'B4-FinPerf RE'!D37-SUM('B1-Sum'!C13:C18)","v":0},{"$f":"'B4-FinPerf RE'!E37-SUM('B1-Sum'!D13:D18)","v":0},{"$f":"'B4-FinPerf RE'!F37-SUM('B1-Sum'!E13:E18)","v":0},{"$f":"'B4-FinPerf RE'!G37-SUM('B1-Sum'!F13:F18)","v":0},{"$f":"'B4-FinPerf RE'!H37-SUM('B1-Sum'!G13:G18)","v":0},{"$f":"'B4-FinPerf RE'!I37-SUM('B1-Sum'!H13:H18)","v":33756952.700000003},33756952.700000003,134275723.00239998,{"$f":"'B4-FinPerf RE'!L37-SUM('B1-Sum'!K13:K18)","v":130860233.27765},{"$f":"'B4-FinPerf RE'!M37-SUM('B1-Sum'!L13:L18)","v":139156711.39565724}]
["Total Expenditure",{"$f":"SUM(B13:B19)","v":223430361.3624},0,0,0,0,0,52032455.700000003,52032455.700000003,275462817.06239998,281847566.27765,299821726.39565724]
["Surplus/(Deficit)",{"$f":"B12-B20","v":116826318.86760002},0,0,0,0,0,-5607255.700000003,-5607255.700000003,111219063.16760004,106146014.72235,118727351.60434276]
["Transfers recognised - capital",{"$f":"'B4-FinPerf RE'!C40","v":62443000},{"$f":"'B4-FinPerf RE'!D40","v":0},{"$f":"'B4-FinPerf RE'!E40","v":0},{"$f":"'B4-FinPerf RE'!F40","v":0},{"$f":"'B4-FinPerf RE'!G40","v":0},{"$f":"'B4-FinPerf RE'!H40","v":0},{"$f":"'B4-FinPerf RE'!I40","v":0},{"$f":"SUM(D22:H22)","v":0},{"$f":"IF(C22=0,B22+I22,C22+I22)","v":62443000},{"$f":"'B4-FinPerf RE'!L40","v":68243000},{"$f":"'B4-FinPerf RE'!M40","v":73283000}]
["Contributions recognised - capital & contributed assets",{"$f":"SUM('B4-FinPerf RE'!C41:C42)","v":0},{"$f":"SUM('B4-FinPerf RE'!D41:D42)","v":0},{"$f":"SUM('B4-FinPerf RE'!E41:E42)","v":0},{"$f":"SUM('B4-FinPerf RE'!F41:F42)","v":0},{"$f":"SUM('B4-FinPerf RE'!G41:G42)","v":0},{"$f":"SUM('B4-FinPerf RE'!H41:H42)","v":0},{"$f":"SUM('B4-FinPerf RE'!I41:I42)","v":0},{"$f":"SUM(D23:H23)","v":0},{"$f":"IF(C23=0,B23+I23,C23+I23)","v":0},{"$f":"SUM('B4-FinPerf RE'!L41:L42)","v":0},{"$f":"SUM('B4-FinPerf RE'!M41:M42)","v":0}]
["Surplus/(Deficit) after capital transfers & contributions",{"$f":"B21+SUM(B22:B23)","v":179269318.86760002},0,0,0,0,0,-5607255.700000003,{"$f":"SUM(D24:H24)","v":-5607255.700000003},{"$f":"IF(C24=0,B24+I24,C24+I24)","v":173662063.16760004},174389014.72235,192010351.60434276]
["Share of surplus/ (deficit) of associate",{"$f":"'B4-FinPerf RE'!C48","v":0},{"$f":"'B4-FinPerf RE'!D48","v":0},{"$f":"'B4-FinPerf RE'!E48","v":0},{"$f":"'B4-FinPerf RE'!F48","v":0},{"$f":"'B4-FinPerf RE'!G48","v":0},{"$f":"'B4-FinPerf RE'!H48","v":0},{"$f":"'B4-FinPerf RE'!I48","v":0},{"$f":"SUM(D25:H25)","v":0},{"$f":"IF(C25=0,B25+I25,C25+I25)","v":0},{"$f":"'B4-FinPerf RE'!L48","v":0},{"$f":"'B4-FinPerf RE'!M48","v":0}]
["Surplus/ (Deficit) for the year",{"$f":"B24+B25","v":179269318.86760002},0,0,0,0,0,-5607255.700000003,-5607255.700000003,173662063.16760004,174389014.72235,192010351.60434276]
[]
["Capital expenditure & funds sources"]
["Capital expenditure",{"$f":"'B5-Capex'!C42","v":179277319.12},{"$f":"'B5-Capex'!D42","v":0},{"$f":"'B5-Capex'!E42","v":0},{"$f":"'B5-Capex'!F42","v":0},{"$f":"'B5-Capex'!G42","v":0},{"$f":"'B5-Capex'!H42","v":0},{"$f":"'B5-Capex'!I42","v":-5615913},{"$f":"SUM(D29:H29)","v":-5615913},{"$f":"IF(C29=0,B29+I29,C29+I29)","v":173661406.12},{"$f":"'B5-Capex'!L42","v":174388883},{"$f":"'B5-Capex'!M42","v":192009876}]
["Transfers recognised - capital",{"$f":"'B5-Capex'!C72","v":62443000},{"$f":"'B5-Capex'!D72","v":0},{"$f":"'B5-Capex'!E72","v":0},{"$f":"'B5-Capex'!F72","v":0},{"$f":"'B5-Capex'!G72","v":0},{"$f":"'B5-Capex'!H72","v":0},{"$f":"'B5-Capex'!I72","v":0},{"$f":"SUM(D30:H30)","v":0},{"$f":"IF(C30=0,B30+I30,C30+I30)","v":62443000},{"$f":"'B5-Capex'!L72","v":68243000},{"$f":"'B5-Capex'!M72","v":73283000}]
["Public contributions & donations",{"$f":"'B5-Capex'!C73","v":0},{"$f":"'B5-Capex'!D73","v":0},{"$f":"'B5-Capex'!E73","v":0},{"$f":"'B5-Capex'!F73","v":0},{"$f":"'B5-Capex'!G73","v":0},{"$f":"'B5-Capex'!H73","v":0},{"$f":"'B5-Capex'!I73","v":0},{"$f":"SUM(D31:H31)","v":0},{"$f":"IF(C31=0,B31+I31,C31+I31)","v":0},{"$f":"'B5-Capex'!L73","v":0},{"$f":"'B5-Capex'!M73","v":0}]
["Borrowing",{"$f":"'B5-Capex'!C74","v":0},{"$f":"'B5-Capex'!D74","v":0},{"$f":"'B5-Capex'!E74","v":0},{"$f":"'B5-Capex'!F74","v":0},{"$f":"'B5-Capex'!G74","v":0},{"$f":"'B5-Capex'!H74","v":0},{"$f":"'B5-Capex'!I74","v":0},{"$f":"SUM(D32:H32)","v":0},{"$f":"IF(C32=0,B32+I32,C32+I32)","v":0},{"$f":"'B5-Capex'!L74","v":0},{"$f":"'B5-Capex'!M74","v":0}]
["Internally generated funds",{"$f":"'B5-Capex'!C75","v":116834318.86},{"$f":"'B5-Capex'!D75","v":0},{"$f":"'B5-Capex'!E75","v":0},{"$f":"'B5-Capex'!F75","v":0},{"$f":"'B5-Capex'!G75","v":0},{"$f":"'B5-Capex'!#REF!","v":{"$error":"#REF!"}},{"$f":"'B5-Capex'!H75","v":0},{"$f":"SUM(D33:H33)","v":{"$error":"#REF!"}},{"$f":"IF(C33=0,B33+I33,C33+I33)","v":{"$error":"#REF!"}},{"$f":"'B5-Capex'!L75","v":118557914},{"$f":"'B5-Capex'!M75","v":115157538}]
["Total sources of capital funds",{"$f":"SUM(B30:B33)","v":179277318.86000001},0,0,0,0,{"$error":"#REF!"},0,{"$error":"#REF!"},{"$error":"#REF!"},186800914,188440538]
[]
["Financial position"]
["Total current assets",{"$f":"'B6-FinPos'!C14","v":96189276.332602009},{"$f":"'B6-FinPos'!D14","v":0},{"$f":"'B6-FinPos'!E14","v":0},{"$f":"'B6-FinPos'!F14","v":0},{"$f":"'B6-FinPos'!G14","v":0},{"$f":"'B6-FinPos'!H14","v":0},{"$f":"'B6-FinPos'!I14","v":-25695000},{"$f":"SUM(D37:H37)","v":-25695000},{"$f":"IF(C37=0,B37+I37,C37+I37)","v":70494276.332602009},{"$f":"'B6-FinPos'!L14","v":76810948.051942512},{"$f":"'B6-FinPos'!M14","v":80766325.194799349}]
["Total non current assets",{"$f":"'B6-FinPos'!C26","v":854921586.60473883},{"$f":"'B6-FinPos'!D26","v":0},{"$f":"'B6-FinPos'!E26","v":0},{"$f":"'B6-FinPos'!F26","v":0},{"$f":"'B6-FinPos'!G26","v":0},{"$f":"'B6-FinPos'!H26","v":0},{"$f":"'B6-FinPos'!I26","v":-5305913},{"$f":"SUM(D38:H38)","v":-5305913},{"$f":"IF(C38=0,B38+I38,C38+I38)","v":849615673.60473883},{"$f":"'B6-FinPos'!L26","v":1005104575.5452082},{"$f":"'B6-FinPos'!M26","v":1011401354.9540744}]
["Total current liabilities",{"$f":"'B6-FinPos'!C36","v":36063204.059},{"$f":"'B6-FinPos'!D36","v":0},{"$f":"'B6-FinPos'!E36","v":0},{"$f":"'B6-FinPos'!F36","v":0},{"$f":"'B6-FinPos'!G36","v":0},{"$f":"'B6-FinPos'!H36","v":0},{"$f":"'B6-FinPos'!I36","v":0},{"$f":"SUM(D39:H39)","v":0},{"$f":"IF(C39=0,B39+I39,C39+I39)","v":36063204.059},{"$f":"'B6-FinPos'!L36","v":35389897.850185998},{"$f":"'B6-FinPos'!M36","v":36511342.23194623}]
["Total non current liabilities",{"$f":"'B6-FinPos'!C41","v":14744449.647768002},{"$f":"'B6-FinPos'!D41","v":0},{"$f":"'B6-FinPos'!E41","v":0},{"$f":"'B6-FinPos'!F41","v":0},{"$f":"'B6-FinPos'!G41","v":0},{"$f":"'B6-FinPos'!H41","v":0},{"$f":"'B6-FinPos'!I41","v":0},{"$f":"SUM(D40:H40)","v":0},{"$f":"IF(C40=0,B40+I40,C40+I40)","v":14744449.647768002},{"$f":"'B6-FinPos'!L41","v":15410142.728747476},{"$f":"'B6-FinPos'!M41","v":16124776.578828588}]
["Community wealth/Equity",{"$f":"'B6-FinPos'!C50","v":900303209.23057282},{"$f":"'B6-FinPos'!D50","v":0},{"$f":"'B6-FinPos'!E50","v":0},{"$f":"'B6-FinPos'!F50","v":0},{"$f":"'B6-FinPos'!G50","v":0},{"$f":"'B6-FinPos'!H50","v":0},{"$f":"'B6-FinPos'!I50","v":-31000913},{"$f":"SUM(D41:H41)","v":-31000913},{"$f":"IF(C41=0,B41+I41,C41+I41)","v":869302296.23057282},{"$f":"'B6-FinPos'!L50","v":1031115483.0182173},{"$f":"'B6-FinPos'!M50","v":1039531561.338099}]
[]
["Cash flows"]
["Net cash from (used) operating",{"$f":"'B7-CFlow'!C19","v":151493540.45599997},{"$f":"'B7-CFlow'!D19","v":0},{"$f":"'B7-CFlow'!E19","v":0},{"$f":"'B7-CFlow'!F19","v":0},{"$f":"'B7-CFlow'!G19","v":0},{"$f":"'B7-CFlow'!H19","v":0},{"$f":"'B7-CFlow'!I19","v":1619000},{"$f":"SUM(D44:H44)","v":1619000},{"$f":"IF(C44=0,B44+I44,C44+I44)","v":153112540.45599997},{"$f":"'B7-CFlow'!L19","v":184553523.40000001},{"$f":"'B7-CFlow'!M19","v":200369368.59999999}]
["Net cash from (used) investing",{"$f":"'B7-CFlow'!C29","v":-144514397.96900001},{"$f":"'B7-CFlow'!D29","v":0},{"$f":"'B7-CFlow'!E29","v":0},{"$f":"'B7-CFlow'!F29","v":0},{"$f":"'B7-CFlow'!G29","v":0},{"$f":"'B7-CFlow'!H29","v":0},{"$f":"'B7-CFlow'!I29","v":-18243000},{"$f":"SUM(D45:H45)","v":-18243000},{"$f":"IF(C45=0,B45+I45,C45+I45)","v":-162757397.96900001},{"$f":"'B7-CFlow'!L29","v":-182943742},{"$f":"'B7-CFlow'!M29","v":-200086737}]
["Net cash from (used) financing",{"$f":"'B7-CFlow'!C38","v":0},{"$f":"'B7-CFlow'!D38","v":0},{"$f":"'B7-CFlow'!E38","v":0},{"$f":"'B7-CFlow'!F38","v":0},{"$f":"'B7-CFlow'!G38","v":0},{"$f":"'B7-CFlow'!H38","v":0},{"$f":"'B7-CFlow'!I38","v":0},{"$f":"SUM(D46:H46)","v":0},{"$f":"IF(C46=0,B46+I46,C46+I46)","v":0},{"$f":"'B7-CFlow'!L38","v":0},{"$f":"'B7-CFlow'!M38","v":0}]
["Cash/cash equivalents at the year end",{"$f":"'B7-CFlow'!C42","v":20650142.486999959},{"$f":"'B7-CFlow'!D42","v":0},{"$f":"'B7-CFlow'!E42","v":0},{"$f":"'B7-CFlow'!F42","v":0},{"$f":"'B7-CFlow'!G42","v":0},{"$f":"'B7-CFlow'!H42","v":0},{"$f":"'B7-CFlow'!I42","v":-16624000},{"$f":"SUM(D47:H47)","v":-16624000},{"$f":"IF(C47=0,B47+I47,C47+I47)","v":4026142.4869999588},{"$f":"'B7-CFlow'!L42","v":5635781.400000006},{"$f":"'B7-CFlow'!M42","v":5918631.599999994}]
[]
["Cash backing/surplus reconciliation"]
["Cash and investments available",{"$f":"'B8-ResRecon'!C10","v":29721281.529999997},{"$f":"'B8-ResRecon'!D10","v":0},{"$f":"'B8-ResRecon'!E10","v":0},{"$f":"'B8-ResRecon'!F10","v":0},{"$f":"'B8-ResRecon'!G10","v":0},{"$f":"'B8-ResRecon'!H10","v":0},{"$f":"'B8-ResRecon'!I10","v":-25695000},{"$f":"SUM(D50:H50)","v":-25695000},{"$f":"IF(C50=0,B50+I50,C50+I50)","v":4026281.5299999975},{"$f":"'B8-ResRecon'!L10","v":7026281.5300000012},{"$f":"'B8-ResRecon'!M10","v":7528502.0141500011}]
["Application of cash and investments",{"$f":"'B8-ResRecon'!C20","v":24636889.647768002},{"$f":"'B8-ResRecon'!D20","v":0},{"$f":"'B8-ResRecon'!E20","v":0},{"$f":"'B8-ResRecon'!F20","v":0},{"$f":"'B8-ResRecon'!G20","v":0},{"$f":"'B8-ResRecon'!H20","v":0},{"$f":"'B8-ResRecon'!I20","v":-6427857},{"$f":"SUM(D51:H51)","v":-6427857},{"$f":"IF(C51=0,B51+I51,C51+I51)","v":18209032.647768002},{"$f":"'B8-ResRecon'!L20","v":19259850.647768002},{"$f":"'B8-ResRecon'!M20","v":18757749.647768002}]
["Balance - surplus (shortfall)",{"$f":"B50-B51","v":5084391.8822319955},0,0,0,0,0,-19267143,-19267143,-14182751.117768005,-12233569.117768001,-11229247.633618001]
[]
["Asset Management"]
["Asset register summary (WDV)",{"$f":"'B9-Asset'!C167","v":854373086.60473883},{"$f":"'B9-Asset'!D167","v":0},{"$f":"'B9-Asset'!E167","v":0},{"$f":"'B9-Asset'!F167","v":0},{"$f":"'B9-Asset'!G167","v":0},{"$f":"'B9-Asset'!H167","v":0},{"$f":"'B9-Asset'!I167","v":-5615913},{"$f":"SUM(D55:H55)","v":-5615913},{"$f":"IF(C55=0,B55+I55,C55+I55)","v":848757173.60473883},{"$f":"'B9-Asset'!L167","v":1004229335.5452082},{"$f":"'B9-Asset'!M167","v":1010508144.2540743}]
["Depreciation & asset impairment",{"$f":"'B9-Asset'!C170","v":5043379.8119640006},{"$f":"'B9-Asset'!D170","v":0},{"$f":"'B9-Asset'!E170","v":0},{"$f":"'B9-Asset'!F170","v":0},{"$f":"'B9-Asset'!G170","v":0},{"$f":"'B9-Asset'!H170","v":0},{"$f":"'B9-Asset'!I170","v":898831.77},{"$f":"SUM(D56:H56)","v":898831.77},{"$f":"IF(C56=0,B56+I56,C56+I56)","v":5942211.5819640011},{"$f":"'B9-Asset'!L170","v":6865247.6830960549},{"$f":"'B9-Asset'!M170","v":7311489.3182064854}]
["Renewal of Existing Assets",{"$f":"'B9-Asset'!C39","v":27083510.539999999},{"$f":"'B9-Asset'!D39","v":0},{"$f":"'B9-Asset'!E39","v":0},{"$f":"'B9-Asset'!F39","v":0},{"$f":"'B9-Asset'!G39","v":0},{"$f":"'B9-Asset'!H39","v":0},{"$f":"'B9-Asset'!I39","v":0},{"$f":"SUM(D57:H57)","v":0},{"$f":"IF(C57=0,B57+I57,C57+I57)","v":27083510.539999999},{"$f":"'B9-Asset'!L39","v":0},{"$f":"'B9-Asset'!M39","v":0}]
["Repairs and Maintenance",{"$f":"'B9-Asset'!C171","v":22098649.140000001},{"$f":"'B9-Asset'!D171","v":0},{"$f":"'B9-Asset'!E171","v":0},{"$f":"'B9-Asset'!F171","v":0},{"$f":"'B9-Asset'!G171","v":0},{"$f":"'B9-Asset'!H171","v":0},{"$f":"'B9-Asset'!I171","v":668652},{"$f":"SUM(D58:H58)","v":668652},{"$f":"IF(C58=0,B58+I58,C58+I58)","v":22767301.140000001},{"$f":"'B9-Asset'!L171","v":11633000},{"$f":"'B9-Asset'!M171","v":12343000}]
[]
["Free services"]
["Cost of Free Basic Services provided",{"$f":"'B10-SerDel'!C62","v":8000},{"$f":"'B10-SerDel'!D62","v":0},{"$f":"'B10-SerDel'!E62","v":0},{"$f":"'B10-SerDel'!F62","v":0},{"$f":"'B10-SerDel'!G62","v":0},{"$f":"'B10-SerDel'!H62","v":0},{"$f":"'B10-SerDel'!I62","v":0},{"$f":"'B10-SerDel'!J62","v":0},{"$f":"'B10-SerDel'!K62","v":8000},{"$f":"'B10-SerDel'!L62","v":8000},{"$f":"'B10-SerDel'!M62","v":8000}]
["Revenue cost of free services provided",{"$f":"'B10-SerDel'!C81","v":11191527.479999999},{"$f":"'B10-SerDel'!D81","v":0},{"$f":"'B10-SerDel'!E81","v":0},{"$f":"'B10-SerDel'!F81","v":0},{"$f":"'B10-SerDel'!G81","v":0},{"$f":"'B10-SerDel'!H81","v":0},{"$f":"'B10-SerDel'!I81","v":0},{"$f":"'B10-SerDel'!J81","v":0},{"$f":"'B10-SerDel'!K81","v":11191527.479999999},{"$f":"'B10-SerDel'!L81","v":11708412.07},{"$f":"'B10-SerDel'!M81","v":12258896.07}]
["Households below minimum service level"]
["Water:",{"$f":"'B10-SerDel'!C16","v":67067},{"$f":"'B10-SerDel'!D16","v":0},{"$f":"'B10-SerDel'!E16","v":0},{"$f":"'B10-SerDel'!F16","v":0},{"$f":"'B10-SerDel'!G16","v":0},{"$f":"'B10-SerDel'!H16","v":0},{"$f":"'B10-SerDel'!I16","v":0},{"$f":"SUM(D64:H64)","v":0},{"$f":"IF(C64=0,B64+I64,C64+I64)","v":67067},{"$f":"'B10-SerDel'!L16","v":67067},{"$f":"'B10-SerDel'!M16","v":67067}]
["Sanitation/sewerage:",{"$f":"'B10-SerDel'!C28","v":11021},{"$f":"'B10-SerDel'!D28","v":0},{"$f":"'B10-SerDel'!E28","v":0},{"$f":"'B10-SerDel'!F28","v":0},{"$f":"'B10-SerDel'!G28","v":0},{"$f":"'B10-SerDel'!H28","v":0},{"$f":"'B10-SerDel'!I28","v":0},{"$f":"SUM(D65:H65)","v":0},{"$f":"IF(C65=0,B65+I65,C65+I65)","v":11021},{"$f":"'B10-SerDel'!L28","v":11021},{"$f":"'B10-SerDel'!M28","v":11021}]
["Energy:",{"$f":"'B10-SerDel'!C37","v":4805},{"$f":"'B10-SerDel'!D37","v":0},{"$f":"'B10-SerDel'!E37","v":0},{"$f":"'B10-SerDel'!F37","v":0},{"$f":"'B10-SerDel'!G37","v":0},{"$f":"'B10-SerDel'!H37","v":0},{"$f":"'B10-SerDel'!I37","v":0},{"$f":"SUM(D66:H66)","v":0},{"$f":"IF(C66=0,B66+I66,C66+I66)","v":4805},{"$f":"'B10-SerDel'!L37","v":4805},{"$f":"'B10-SerDel'!M37","v":4805}]
["Refuse:",{"$f":"'B10-SerDel'!C47","v":59613},{"$f":"'B10-SerDel'!D47","v":0},{"$f":"'B10-SerDel'!E47","v":0},{"$f":"'B10-SerDel'!F47","v":0},{"$f":"'B10-SerDel'!G47","v":0},{"$f":"'B10-SerDel'!H47","v":0},{"$f":"'B10-SerDel'!I47","v":0},{"$f":"SUM(D67:H67)","v":0},{"$f":"IF(C67=0,B67+I67,C67+I67)","v":59613},{"$f":"'B10-SerDel'!L47","v":59613},{"$f":"'B10-SerDel'!M47","v":59613}]
[]
["References"]
["1. Only complete if a previous adjusted budget has been approved in the same financial year. Reflect most recent adjusted budget."]
["2. Additional cash-backed accumulated funds/unspent funds (MFMA section 18(1)(b) and section 28(2)(e)) identified after the Original Budget approved and after annual financial statements audited (note: only where underspending could not reasonably have been foreseen)"]
["3. Increases of funds approved under MFMA section 31"]
["4. Adjustments approved in accordance with MFMA section 29 "]
["5. Adjustments to transfers from National or Provincial Government"]
["6. Adjusts. = 'Other' Adjustments proposed to be approved; including revenue under-collection (MFMA section 28(2)(a)); additional revenue appropriation on existing programmes (section 28(2))(b); projected savings (section 28(2)(d)); error correction (section 28(2)(f))"]
["7. G = B + C + D + E + F"]
["8. Adjusted Budget H = (A or A1/2 etc) + G"]

{"sheet":"B2-FinPerf SC","index":7,"n_rows":64,"n_cols":13,"rows_kept":64,"cut":false,"hidden":false,"merged":[[63,0,63,12],[58,0,58,12],[59,0,59,12],[61,0,61,12],[1,0,2,0],[1,1,2,1],[56,0,56,12],[57,0,57,12],[54,0,54,12],[1,2,1,10],[55,0,55,10]]}
[{"$f":"muni&\" - \"&_ADJ3&\" - \"&Date","v":"LIM332 Greater Letaba - Table B2 Adjustments Budget Financial Performance (functional classification) - 27 February 2019"}]
[{"$f":"\"Standard \"&desc","v":"Standard Description"},{"$f":"head27","v":"Ref"},{"$f":"Head2","v":"Budget Year 2018/19"},null,null,null,null,null,null,null,null,{"$f":"Head10","v":"Budget Year +1 2019/20"},{"$f":"Head11","v":"Budget Year +2 2020/21"}]
[null,null,{"$f":"Head6","v":"Original Budget"},{"$f":"Head54","v":"Prior Adjusted"},{"$f":"Head51","v":"Accum. Funds"},{"$f":"Head52","v":"Multi-year capital"},{"$f":"Head53","v":"Unfore. Unavoid."},{"$f":"Head55","v":"Nat. or Prov. Govt"},{"$f":"Head50","v":"Other Adjusts."},{"$f":"Head56","v":"Total Adjusts."},{"$f":"Head7","v":"Adjusted Budget"},{"$f":"Head7","v":"Adjusted Budget"},{"$f":"Head7","v":"Adjusted Budget"}]
[null,null,null,5,{"$f":"D4+1","v":6},7,8,9,10,11,12]
["R thousands","1, 4","A","A1","B","C","D","E","F","G","H"]
["Revenue - Functional"]
["Governance and administration",null,{"$f":"SUM(C8:C10)","v":366195306.97000003},{"$f":"SUM(D8:D10)","v":0},0,0,0,0,15394214,{"$f":"SUM(J8:J10)","v":15394214},{"$f":"SUM(K8:K10)","v":381589520.97000003},{"$f":"SUM(L8:L10)","v":384096221},{"$f":"SUM(M8:M10)","v":413827901.5}]
["Executive and council",null,{"$f":"B2B!C8","v":0},{"$f":"B2B!D8","v":0},{"$f":"B2B!E8","v":0},{"$f":"B2B!F8","v":0},{"$f":"B2B!G8","v":0},{"$f":"B2B!H8","v":0},{"$f":"B2B!I8","v":0},{"$f":"SUM(E8:I8)","v":0},{"$f":"IF(D8=0,C8+J8,D8+J8)","v":0},{"$f":"B2B!L8","v":0},{"$f":"B2B!M8","v":0}]
["Finance and administration",null,{"$f":"B2B!C11","v":366195306.97000003},{"$f":"B2B!D11","v":0},{"$f":"B2B!E11","v":0},{"$f":"B2B!F11","v":0},{"$f":"B2B!G11","v":0},{"$f":"B2B!H11","v":0},{"$f":"B2B!I11","v":15394214},{"$f":"SUM(E9:I9)","v":15394214},{"$f":"IF(D9=0,C9+J9,D9+J9)","v":381589520.97000003},{"$f":"B2B!L11","v":384096221},{"$f":"B2B!M11","v":413827901.5}]
["Internal audit",null,{"$f":"B2B!C26","v":0},{"$f":"B2B!D26","v":0},{"$f":"B2B!E26","v":0},{"$f":"B2B!F26","v":0},{"$f":"B2B!G26","v":0},{"$f":"B2B!H26","v":0},{"$f":"B2B!I26","v":0},{"$f":"SUM(E10:I10)","v":0},{"$f":"IF(D10=0,C10+J10,D10+J10)","v":0},{"$f":"B2B!L26","v":0},{"$f":"B2B!M26","v":0}]
["Community and public safety",null,{"$f":"SUM(C12:C16)","v":0},{"$f":"SUM(D12:D16)","v":0},0,0,0,0,0,{"$f":"SUM(J12:J16)","v":0},{"$f":"SUM(K12:K16)","v":0},{"$f":"SUM(L12:L16)","v":0},{"$f":"SUM(M12:M16)","v":0}]
["Community and social services",null,{"$f":"B2B!C29","v":0},{"$f":"B2B!D29","v":0},{"$f":"B2B!E29","v":0},{"$f":"B2B!F29","v":0},{"$f":"B2B!G29","v":0},{"$f":"B2B!H29","v":0},{"$f":"B2B!I29","v":0},{"$f":"SUM(E12:I12)","v":0},{"$f":"IF(D12=0,C12+J12,D12+J12)","v":0},{"$f":"B2B!L29","v":0},{"$f":"B2B!M29","v":0}]
["Sport and recreation",null,{"$f":"B2B!C51","v":0},{"$f":"B2B!D51","v":0},{"$f":"B2B!E51","v":0},{"$f":"B2B!F51","v":0},{"$f":"B2B!G51","v":0},{"$f":"B2B!H51","v":0},{"$f":"B2B!I51","v":0},{"$f":"SUM(E13:I13)","v":0},{"$f":"IF(D13=0,C13+J13,D13+J13)","v":0},{"$f":"B2B!L51","v":0},{"$f":"B2B!M51","v":0}]
["Public safety",null,{"$f":"B2B!C57","v":0},{"$f":"B2B!D57","v":0},{"$f":"B2B!E57","v":0},{"$f":"B2B!F57","v":0},{"$f":"B2B!G57","v":0},{"$f":"B2B!H57","v":0},{"$f":"B2B!I57","v":0},{"$f":"SUM(E14:I14)","v":0},{"$f":"IF(D14=0,C14+J14,D14+J14)","v":0},{"$f":"B2B!L57","v":0},{"$f":"B2B!M57","v":0}]
["Housing",null,{"$f":"B2B!C64","v":0},{"$f":"B2B!D64","v":0},{"$f":"B2B!E64","v":0},{"$f":"B2B!F64","v":0},{"$f":"B2B!G64","v":0},{"$f":"B2B!H64","v":0},{"$f":"B2B!I64","v":0},{"$f":"SUM(E15:I15)","v":0},{"$f":"IF(D15=0,C15+J15,D15+J15)","v":0},{"$f":"B2B!L64","v":0},{"$f":"B2B!M64","v":0}]
["Health",null,{"$f":"B2B!C67","v":0},{"$f":"B2B!D67","v":0},{"$f":"B2B!E67","v":0},{"$f":"B2B!F67","v":0},{"$f":"B2B!G67","v":0},{"$f":"B2B!H67","v":0},{"$f":"B2B!I67","v":0},{"$f":"SUM(E16:I16)","v":0},{"$f":"IF(D16=0,C16+J16,D16+J16)","v":0},{"$f":"B2B!L67","v":0},{"$f":"B2B!M67","v":0}]
["Economic and environmental services",null,{"$f":"SUM(C18:C20)","v":11461019},{"$f":"SUM(D18:D20)","v":0},0,0,0,0,14600000,{"$f":"SUM(J18:J20)","v":14600000},{"$f":"SUM(K18:K20)","v":26061019},{"$f":"SUM(L18:L20)","v":27754985},{"$f":"SUM(M18:M20)","v":29559059}]
["Planning and development",null,{"$f":"B2B!C76","v":0},{"$f":"B2B!D76","v":0},{"$f":"B2B!E76","v":0},{"$f":"B2B!F76","v":0},{"$f":"B2B!G76","v":0},{"$f":"B2B!H76","v":0},{"$f":"B2B!I76","v":0},{"$f":"SUM(E18:I18)","v":0},{"$f":"IF(D18=0,C18+J18,D18+J18)","v":0},{"$f":"B2B!L76","v":0},{"$f":"B2B!M76","v":0}]
["Road transport",null,{"$f":"B2B!C87","v":11461019},{"$f":"B2B!D87","v":0},{"$f":"B2B!E87","v":0},{"$f":"B2B!F87","v":0},{"$f":"B2B!G87","v":0},{"$f":"B2B!H87","v":0},{"$f":"B2B!I87","v":14600000},{"$f":"SUM(E19:I19)","v":14600000},{"$f":"IF(D19=0,C19+J19,D19+J19)","v":26061019},{"$f":"B2B!L87","v":27754985},{"$f":"B2B!M87","v":29559059}]
["Environmental protection",null,{"$f":"B2B!C94","v":0},{"$f":"B2B!D94","v":0},{"$f":"B2B!E94","v":0},{"$f":"B2B!F94","v":0},{"$f":"B2B!G94","v":0},{"$f":"B2B!H94","v":0},{"$f":"B2B!I94","v":0},{"$f":"SUM(E20:I20)","v":0},{"$f":"IF(D20=0,C20+J20,D20+J20)","v":0},{"$f":"B2B!L94","v":0},{"$f":"B2B!M94","v":0}]
["Trading services",null,{"$f":"SUM(C22:C25)","v":25051354.469999999},{"$f":"SUM(D22:D25)","v":0},0,0,0,0,16422987,16422987,41474341.469999999,44386277,48445111]
["Energy sources",null,{"$f":"B2B!C102","v":18807957.469999999},{"$f":"B2B!D102","v":0},{"$f":"B2B!E102","v":0},{"$f":"B2B!F102","v":0},{"$f":"B2B!G102","v":0},{"$f":"B2B!H102","v":0},{"$f":"B2B!I102","v":14422987},{"$f":"SUM(E22:I22)","v":14422987},{"$f":"IF(D22=0,C22+J22,D22+J22)","v":33230944.469999999},{"$f":"B2B!L102","v":36672060},{"$f":"B2B!M102","v":40229469}]
["Water management",null,{"$f":"B2B!C106","v":0},{"$f":"B2B!D106","v":0},{"$f":"B2B!E106","v":0},{"$f":"B2B!F106","v":0},{"$f":"B2B!G106","v":0},{"$f":"B2B!H106","v":0},{"$f":"B2B!I106","v":0},{"$f":"SUM(E23:I23)","v":0},{"$f":"IF(D23=0,C23+J23,D23+J23)","v":0},{"$f":"B2B!L106","v":0},{"$f":"B2B!M106","v":0}]
["Waste water management",null,{"$f":"B2B!C110","v":0},{"$f":"B2B!D110","v":0},{"$f":"B2B!E110","v":0},{"$f":"B2B!F110","v":0},{"$f":"B2B!G110","v":0},{"$f":"B2B!H110","v":0},{"$f":"B2B!I110","v":0},{"$f":"SUM(E24:I24)","v":0},{"$f":"IF(D24=0,C24+J24,D24+J24)","v":0},{"$f":"B2B!L110","v":0},{"$f":"B2B!M110","v":0}]
["Waste management",null,{"$f":"B2B!C115","v":6243397},{"$f":"B2B!D115","v":0},{"$f":"B2B!E115","v":0},{"$f":"B2B!F115","v":0},{"$f":"B2B!G115","v":0},{"$f":"B2B!H115","v":0},{"$f":"B2B!I115","v":2000000},{"$f":"SUM(E25:I25)","v":2000000},{"$f":"IF(D25=0,C25+J25,D25+J25)","v":8243397},{"$f":"B2B!L115","v":7714217},{"$f":"B2B!M115","v":8215642}]
["Other",null,{"$f":"B2B!C120","v":0},{"$f":"B2B!D120","v":0},{"$f":"B2B!E120","v":0},{"$f":"B2B!F120","v":0},{"$f":"B2B!G120","v":0},{"$f":"B2B!H120","v":0},{"$f":"B2B!I120","v":0},{"$f":"SUM(E26:I26)","v":0},{"$f":"IF(D26=0,C26+J26,D26+J26)","v":0},{"$f":"B2B!L120","v":0},{"$f":"B2B!M120","v":0}]
[{"$f":"\"Total \"&A6","v":"Total Revenue - Functional"},2,{"$f":"C7+C11+C17+C21+C26","v":402707680.44000006},{"$f":"D7+D11+D17+D21+D26","v":0},0,0,0,0,46417201,46417201,449124881.44000006,456237483,491832071.5]
[]
["Expenditure - Functional"]
["Governance and administration",null,{"$f":"SUM(C31:C33)","v":124146230.87999998},{"$f":"SUM(D31:D33)","v":0},0,0,0,0,21605438,{"$f":"SUM(J31:J33)","v":21605438},{"$f":"SUM(K31:K33)","v":145751668.88},{"$f":"SUM(L31:L33)","v":156319101},{"$f":"SUM(M31:M33)","v":166179736}]
["Executive and council",null,{"$f":"B2B!C131","v":47800391.169999994},{"$f":"B2B!D131","v":0},{"$f":"B2B!E131","v":0},{"$f":"B2B!F131","v":0},{"$f":"B2B!G131","v":0},{"$f":"B2B!H131","v":0},{"$f":"B2B!I131","v":4582728},{"$f":"SUM(E31:I31)","v":4582728},{"$f":"IF(D31=0,C31+J31,D31+J31)","v":52383119.169999994},{"$f":"B2B!L131","v":56492940},{"$f":"B2B!M131","v":60004430}]
["Finance and administration",null,{"$f":"B2B!C134","v":74406900.689999998},{"$f":"B2B!D134","v":0},{"$f":"B2B!E134","v":0},{"$f":"B2B!F134","v":0},{"$f":"B2B!G134","v":0},{"$f":"B2B!H134","v":0},{"$f":"B2B!I134","v":16494696},{"$f":"SUM(E32:I32)","v":16494696},{"$f":"IF(D32=0,C32+J32,D32+J32)","v":90901596.689999998},{"$f":"B2B!L134","v":97198856},{"$f":"B2B!M134","v":103377226}]
["Internal audit",null,{"$f":"B2B!C149","v":1938939.02},{"$f":"B2B!D149","v":0},{"$f":"B2B!E149","v":0},{"$f":"B2B!F149","v":0},{"$f":"B2B!G149","v":0},{"$f":"B2B!H149","v":0},{"$f":"B2B!I149","v":528014},{"$f":"SUM(E33:I33)","v":528014},{"$f":"IF(D33=0,C33+J33,D33+J33)","v":2466953.02},{"$f":"B2B!L149","v":2627305},{"$f":"B2B!M149","v":2798080}]
["Community and public safety",null,{"$f":"SUM(C35:C39)","v":12752759.719999999},{"$f":"SUM(D35:D39)","v":0},0,0,0,0,5320886,{"$f":"SUM(J35:J39)","v":5320886},{"$f":"SUM(K35:K39)","v":18073645.719999999},{"$f":"SUM(L35:L39)","v":19248432},{"$f":"SUM(M35:M39)","v":20499580}]
["Community and social services",null,{"$f":"B2B!C152","v":4334295.18},{"$f":"B2B!D152","v":0},{"$f":"B2B!E152","v":0},{"$f":"B2B!F152","v":0},{"$f":"B2B!G152","v":0},{"$f":"B2B!H152","v":0},{"$f":"B2B!I152","v":681923},{"$f":"SUM(E35:I35)","v":681923},{"$f":"IF(D35=0,C35+J35,D35+J35)","v":5016218.18},{"$f":"B2B!L152","v":5342273},{"$f":"B2B!M152","v":5689520}]
["Sport and recreation",null,{"$f":"B2B!C174","v":7690965.4299999997},{"$f":"B2B!D174","v":0},{"$f":"B2B!E174","v":0},{"$f":"B2B!F174","v":0},{"$f":"B2B!G174","v":0},{"$f":"B2B!H174","v":0},{"$f":"B2B!I174","v":4638963},{"$f":"SUM(E36:I36)","v":4638963},{"$f":"IF(D36=0,C36+J36,D36+J36)","v":12329928.43},{"$f":"B2B!L174","v":13131373},{"$f":"B2B!M174","v":13984913}]
["Public safety",null,{"$f":"B2B!C180","v":0},{"$f":"B2B!D180","v":0},{"$f":"B2B!E180","v":0},{"$f":"B2B!F180","v":0},{"$f":"B2B!G180","v":0},{"$f":"B2B!H180","v":0},{"$f":"B2B!I180","v":0},{"$f":"SUM(E37:I37)","v":0},{"$f":"IF(D37=0,C37+J37,D37+J37)","v":0},{"$f":"B2B!L180","v":0},{"$f":"B2B!M180","v":0}]
["Housing",null,{"$f":"B2B!C187","v":727499.11},{"$f":"B2B!D187","v":0},{"$f":"B2B!E187","v":0},{"$f":"B2B!F187","v":0},{"$f":"B2B!G187","v":0},{"$f":"B2B!H187","v":0},{"$f":"B2B!I187","v":0},{"$f":"SUM(E38:I38)","v":0},{"$f":"IF(D38=0,C38+J38,D38+J38)","v":727499.11},{"$f":"B2B!L187","v":774786},{"$f":"B2B!M187","v":825147}]
["Health",null,{"$f":"B2B!C190","v":0},{"$f":"B2B!D190","v":0},{"$f":"B2B!E190","v":0},{"$f":"B2B!F190","v":0},{"$f":"B2B!G190","v":0},{"$f":"B2B!H190","v":0},{"$f":"B2B!I190","v":0},{"$f":"SUM(E39:I39)","v":0},{"$f":"IF(D39=0,C39+J39,D39+J39)","v":0},{"$f":"B2B!L190","v":0},{"$f":"B2B!M190","v":0}]
["Economic and environmental services",null,{"$f":"SUM(C41:C43)","v":48381784.74000001},{"$f":"SUM(D41:D43)","v":0},0,0,0,0,17036145,{"$f":"SUM(J41:J43)","v":17036145},{"$f":"SUM(K41:K43)","v":65417929.74000001},{"$f":"SUM(L41:L43)","v":57055622},{"$f":"SUM(M41:M43)","v":60718751}]
["Planning and development",null,{"$f":"B2B!C199","v":13504109.48},{"$f":"B2B!D199","v":0},{"$f":"B2B!E199","v":0},{"$f":"B2B!F199","v":0},{"$f":"B2B!G199","v":0},{"$f":"B2B!H199","v":0},{"$f":"B2B!I199","v":-1917559},{"$f":"SUM(E41:I41)","v":-1917559},{"$f":"IF(D41=0,C41+J41,D41+J41)","v":11586550.48},{"$f":"B2B!L199","v":12339676},{"$f":"B2B!M199","v":13141754}]
["Road transport",null,{"$f":"B2B!C210","v":34877675.260000005},{"$f":"B2B!D210","v":0},{"$f":"B2B!E210","v":0},{"$f":"B2B!F210","v":0},{"$f":"B2B!G210","v":0},{"$f":"B2B!H210","v":0},{"$f":"B2B!I210","v":18953704},{"$f":"SUM(E42:I42)","v":18953704},{"$f":"IF(D42=0,C42+J42,D42+J42)","v":53831379.260000005},{"$f":"B2B!L210","v":44715946},{"$f":"B2B!M210","v":47576997}]
["Environmental protection",null,{"$f":"B2B!C217","v":0},{"$f":"B2B!D217","v":0},{"$f":"B2B!E217","v":0},{"$f":"B2B!F217","v":0},{"$f":"B2B!G217","v":0},{"$f":"B2B!H217","v":0},{"$f":"B2B!I217","v":0},{"$f":"SUM(E43:I43)","v":0},{"$f":"IF(D43=0,C43+J43,D43+J43)","v":0},{"$f":"B2B!L217","v":0},{"$f":"B2B!M217","v":0}]
["Trading services",null,{"$f":"SUM(C45:C48)","v":38149586.189999998},{"$f":"SUM(D45:D48)","v":0},0,0,0,0,8070636,8070636,46220222.189999998,49224534,52424129]
["Energy sources",null,{"$f":"B2B!C225","v":32487354.719999999},{"$f":"B2B!D225","v":0},{"$f":"B2B!E225","v":0},{"$f":"B2B!F225","v":0},{"$f":"B2B!G225","v":0},{"$f":"B2B!H225","v":0},{"$f":"B2B!I225","v":7962807},{"$f":"SUM(E45:I45)","v":7962807},{"$f":"IF(D45=0,C45+J45,D45+J45)","v":40450161.719999999},{"$f":"B2B!L225","v":43079420},{"$f":"B2B!M225","v":45879583}]
["Water management",null,{"$f":"B2B!C229","v":0},{"$f":"B2B!D229","v":0},{"$f":"B2B!E229","v":0},{"$f":"B2B!F229","v":0},{"$f":"B2B!G229","v":0},{"$f":"B2B!H229","v":0},{"$f":"B2B!I229","v":0},{"$f":"SUM(E46:I46)","v":0},{"$f":"IF(D46=0,C46+J46,D46+J46)","v":0},{"$f":"B2B!L229","v":0},{"$f":"B2B!M229","v":0}]
["Waste water management",null,{"$f":"B2B!C233","v":686133},{"$f":"B2B!D233","v":0},{"$f":"B2B!E233","v":0},{"$f":"B2B!F233","v":0},{"$f":"B2B!G233","v":0},{"$f":"B2B!H233","v":0},{"$f":"B2B!I233","v":14324},{"$f":"SUM(E47:I47)","v":14324},{"$f":"IF(D47=0,C47+J47,D47+J47)","v":700457},{"$f":"B2B!L233","v":745986},{"$f":"B2B!M233","v":794475}]
["Waste management",null,{"$f":"B2B!C238","v":4976098.47},{"$f":"B2B!D238","v":0},{"$f":"B2B!E238","v":0},{"$f":"B2B!F238","v":0},{"$f":"B2B!G238","v":0},{"$f":"B2B!H238","v":0},{"$f":"B2B!I238","v":93505},{"$f":"SUM(E48:I48)","v":93505},{"$f":"IF(D48=0,C48+J48,D48+J48)","v":5069603.47},{"$f":"B2B!L238","v":5399128},{"$f":"B2B!M238","v":5750071}]
["Other",null,{"$f":"B2B!C243","v":0},{"$f":"B2B!D243","v":0},{"$f":"B2B!E243","v":0},{"$f":"B2B!F243","v":0},{"$f":"B2B!G243","v":0},{"$f":"B2B!H243","v":0},{"$f":"B2B!I243","v":0},{"$f":"SUM(E49:I49)","v":0},{"$f":"IF(D49=0,C49+J49,D49+J49)","v":0},{"$f":"B2B!L243","v":0},{"$f":"B2B!M243","v":0}]
[{"$f":"\"Total \"&A29","v":"Total Expenditure - Functional"},3,{"$f":"C30+C34+C40+C44+C49","v":223430361.52999997},{"$f":"D30+D34+D40+D44+D49","v":0},0,0,0,0,52033105,52033105,275463466.52999997,281847689,299822196]
["Surplus/ (Deficit) for the year",null,{"$f":"C27-C50","v":179277318.91000009},0,0,0,0,0,-5615904,-5615904,173661414.91000009,174389794,192009875.5]
[{"$f":"head27a","v":"References"}]
["1. Government Finance Statistics Functions and Sub-functions are standardised to assist the compilation of national and international accounts for comparison purposes"]
["2. Total Revenue by standard classification must reconcile to Total Operating Revenue shown in the Adjustments Budget Financial Performance (revenue and expenditure)"]
["3. Total Operating Expenditure by standard classification must reconcile to Total Operating Expenditure shown in the Adjustments Budget Financial Performance (revenue and expenditure)"]
["4. All amounts must be classified under a standard classification (modified GFS). The GFS function 'Other' is only for Abbatoirs, Air Transport, Markets and Tourism - and if used must be supported by footnotes. Nothing else may be placed under 'Other'. Assign associate share to relevant classification"]
["5. Only complete if a previous adjusted budget has been approved in the same financial year. Reflect most recent adjusted budget."]
["6. Additional cash-backed accumulated funds/unspent funds (MFMA section 18(1)(b) and section 28(2)(e)) identified after the Original Budget approved and after annual financial statements audited (note: only where underspending could not reasonably have been foreseen)"]
["7. Increases of funds approved under MFMA section 31"]
["8. Adjustments approved in accordance with MFMA section 29 "]
["9. Adjustments to transfers from National or Provincial Government"]
["10. Adjusts. = 'Other' Adjustments proposed to be approved; including revenue under-collection (MFMA section 28(2)(a)); additional revenue appropriation on existing programmes (section 28(2))(b); projected savings (section 28(2)(d)); error correction (section 28(2)(f))"]
["11. G = B + C + D + E + F"]
["12. Adjusted Budget H = (A or A1/2 etc) + G"]

{"sheet":"B2B","index":8,"n_rows":256,"n_cols":13,"rows_kept":256,"cut":false,"hidden":false,"merged":[[255,0,255,10],[1,2,1,10]]}
[{"$f":"muni&\" - \"&_ADJ3&\" - B\"&\" - \"&Date","v":"LIM332 Greater Letaba - Table B2 Adjustments Budget Financial Performance (functional classification) - B - 27 February 2019"}]
[{"$f":"\"Standard Classification \"&desc","v":"Standard Classification Description"},{"$f":"head27","v":"Ref"},{"$f":"Head2","v":"Budget Year 2018/19"},null,null,null,null,null,null,null,null,{"$f":"Head10","v":"Budget Year +1 2019/20"},{"$f":"Head11","v":"Budget Year +2 2020/21"}]
[null,null,{"$f":"Head6","v":"Original Budget"},{"$f":"Head54","v":"Prior Adjusted"},{"$f":"Head51","v":"Accum. Funds"},{"$f":"Head52","v":"Multi-year capital"},{"$f":"Head53","v":"Unfore. Unavoid."},{"$f":"Head55","v":"Nat. or Prov. Govt"},{"$f":"Head50","v":"Other Adjusts."},{"$f":"Head56","v":"Total Adjusts."},{"$f":"Head7","v":"Adjusted Budget"},{"$f":"Head7","v":"Adjusted Budget"},{"$f":"Head7","v":"Adjusted Budget"}]
[null,null,null,5,{"$f":"D4+1","v":6},7,8,9,10,11,12]
["R thousand",1,"A","A1","B","C","D","E","F","G","H"]
["Revenue - Functional"]
["Municipal governance and administration",null,{"$f":"C8+C11+C26","v":366195306.97000003},0,0,0,0,0,15394214,{"$f":"SUM(E7:I7)","v":15394214},{"$f":"IF(D7=0,C7+J7,D7+J7)","v":381589520.97000003},384096221,413827901.5]
["Executive and council",null,{"$f":"SUM(C9:C10)","v":0},{"$f":"SUM(D9:D10)","v":0},0,0,0,0,0,{"$f":"SUM(E8:I8)","v":0},{"$f":"IF(D8=0,C8+J8,D8+J8)","v":0},{"$f":"SUM(L9:L10)","v":0},{"$f":"SUM(M9:M10)","v":0}]
["Mayor and Council",null,null,null,null,null,null,null,null,{"$f":"SUM(E9:I9)","v":0},{"$f":"IF(D9=0,C9+J9,D9+J9)","v":0}]
["Municipal Manager, Town Secretary and Chief Executive",null,null,null,null,null,null,null,null,{"$f":"SUM(E10:I10)","v":0},{"$f":"IF(D10=0,C10+J10,D10+J10)","v":0}]
["Finance and administration",null,{"$f":"SUM(C12:C25)","v":366195306.97000003},{"$f":"SUM(D12:D25)","v":0},0,0,0,0,15394214,15394214,381589520.97000003,{"$f":"SUM(L12:L25)","v":384096221},{"$f":"SUM(M12:M25)","v":413827901.5}]
["Administrative and Corporate Support",null,null,null,null,null,null,null,null,0,0]
["Asset Management",null,null,null,null,null,null,null,null,0,0]
["Budget and Treasury Office",null,366195306.97000003,null,null,null,null,null,{"$f":"3607959+8786255+3000000","v":15394214},15394214,381589520.97000003,{"$f":"386617221-2521000","v":384096221},{"$f":"417083255-3255353.5","v":413827901.5}]
["Finance",null,null,null,null,null,null,null,null,0,0]
["Fleet Management",null,null,null,null,null,null,null,null,0,0]
["Human Resources",null,null,null,null,null,null,null,null,0,0]
["Information Technology",null,null,null,null,null,null,null,null,0,0]
["Legal Services",null,null,null,null,null,null,null,null,0,0]
["Marketing, Customer Relations, Publicity and Media Co-ordination",null,null,null,null,null,null,null,null,0,0]
["Property Services",null,null,null,null,null,null,null,null,0,0]
["Risk Management",null,null,null,null,null,null,null,null,0,0]
["Security Services",null,null,null,null,null,null,null,null,0,0]
["Supply Chain Management ",null,null,null,null,null,null,null,null,0,0]
["Valuation Service",null,null,null,null,null,null,null,null,0,0]
["Internal audit",null,{"$f":"SUM(C27:C27)","v":0},0,0,0,0,0,0,0,0,0,0]
["Governance Function",null,null,null,null,null,null,null,null,0,0]
["Community and public safety",null,{"$f":"C29+C51+C57+C64+C67","v":0},{"$f":"D29+D51+D57+D64+D67","v":0},0,0,0,0,0,0,0,0,0]
["Community and social services",null,{"$f":"SUM(C30:C50)","v":0},0,0,0,0,0,0,0,0,0,0]
["Aged Care",null,null,null,null,null,null,null,null,0,0]
["Agricultural",null,null,null,null,null,null,null,null,0,0]
["Animal Care and Diseases",null,null,null,null,null,null,null,null,0,0]
["Cemeteries, Funeral Parlours and Crematoriums",null,null,null,null,null,null,null,null,0,0]
["Child Care Facilities",null,null,null,null,null,null,null,null,0,0]
["Community Halls and Facilities",null,null,null,null,null,null,null,null,0,0]
["Consumer Protection",null,null,null,null,null,null,null,null,0,0]
["Cultural Matters",null,null,null,null,null,null,null,null,0,0]
["Disaster Management",null,null,null,null,null,null,null,null,0,0]
["Education",null,null,null,null,null,null,null,null,0,0]
["Indigenous and Customary Law",null,null,null,null,null,null,null,null,0,0]
["Industrial Promotion",null,null,null,null,null,null,null,null,0,0]
["Language Policy",null,null,null,null,null,null,null,null,0,0]
["Libraries and Archives",null,null,null,null,null,null,null,null,0,0]
["Literacy Programmes",null,null,null,null,null,null,null,null,0,0]
["Media Services",null,null,null,null,null,null,null,null,0,0]
["Museums and Art Galleries",null,null,null,null,null,null,null,null,0,0]
["Population Development",null,null,null,null,null,null,null,null,0,0]
["Provincial Cultural Matters",null,null,null,null,null,null,null,null,0,0]
["Theatres",null,null,null,null,null,null,null,null,0,0]
["Zoo's",null,null,null,null,null,null,null,null,0,0]
["Sport and recreation",null,{"$f":"SUM(C52:C56)","v":0},0,0,0,0,0,0,0,0,0,0]
["Beaches and Jetties ",null,null,null,null,null,null,null,null,0,0]
["Casinos, Racing, Gambling, Wagering",null,null,null,null,null,null,null,null,0,0]
["Community Parks (including Nurseries)",null,null,null,null,null,null,null,null,0,0]
["Recreational Facilities",null,null,null,null,null,null,null,null,0,0]
["Sports Grounds and Stadiums",null,null,null,null,null,null,null,null,0,0]
["Public safety",null,{"$f":"SUM(C58:C63)","v":0},0,0,0,0,0,0,0,0,0,0]
["Civil Defence",null,null,null,null,null,null,null,null,0,0]
["Cleansing",null,null,null,null,null,null,null,null,0,0]
["Control of Public Nuisances",null,null,null,null,null,null,null,null,0,0]
["Fencing and Fences ",null,null,null,null,null,null,null,null,0,0]
["Fire Fighting and Protection",null,null,null,null,null,null,null,null,0,0]
["Licensing and Control of Animals",null,null,null,null,null,null,null,null,0,0]
["Housing",null,{"$f":"SUM(C65:C66)","v":0},{"$f":"SUM(D65:D66)","v":0},0,0,0,0,0,0,0,{"$f":"SUM(L65:L66)","v":0},{"$f":"SUM(M65:M66)","v":0}]
["Housing",null,null,null,null,null,null,null,null,0,0]
["Informal Settlements",null,null,null,null,null,null,null,null,0,0]
["Health",null,{"$f":"SUM(C68:C74)","v":0},{"$f":"SUM(D68:D74)","v":0},0,0,0,0,0,0,0,{"$f":"SUM(L68:L74)","v":0},{"$f":"SUM(M68:M74)","v":0}]
["Ambulance",null,null,null,null,null,null,null,null,0,0]
["Health Services",null,null,null,null,null,null,null,null,0,0]
["Laboratory Services",null,null,null,null,null,null,null,null,0,0]
["Food Control",null,null,null,null,null,null,null,null,0,0]
["Health Surveillance and Prevention of Communicable Diseases including immunizations",null,null,null,null,null,null,null,null,0,0]
["Vector Control",null,null,null,null,null,null,null,null,0,0]
["Chemical Safety",null,null,null,null,null,null,null,null,{"$f":"SUM(E74:I74)","v":0},{"$f":"IF(D74=0,C74+J74,D74+J74)","v":0}]
["Economic and environmental services",null,{"$f":"C76+C87+C94","v":11461019},{"$f":"D76+D87+D94","v":0},0,0,0,0,14600000,14600000,26061019,{"$f":"L76+L87+L94","v":27754985},{"$f":"M76+M87+M94","v":29559059}]
["Planning and development",null,{"$f":"SUM(C77:C86)","v":0},{"$f":"SUM(D77:D86)","v":0},0,0,0,0,0,0,0,{"$f":"SUM(L77:L86)","v":0},{"$f":"SUM(M77:M86)","v":0}]
["Billboards",null,null,null,null,null,null,null,null,0,0]
["Corporate Wide Strategic Planning (IDPs, LEDs)",null,null,null,null,null,null,null,null,0,0]
["Central City Improvement District",null,null,null,null,null,null,null,null,0,0]
["Development Facilitation",null,null,null,null,null,null,null,null,0,0]
["Economic Development/Planning",null,null,null,null,null,null,null,null,0,0]
["Regional Planning and Development",null,null,null,null,null,null,null,null,0,0]
["Town Planning, Building Regulations and Enforcement, and City Engineer",null,null,null,null,null,null,null,null,0,0]
["Project Management Unit",null,null,null,null,null,null,null,null,0,0]
["Provincial Planning",null,null,null,null,null,null,null,null,0,0]
["Support to Local Municipalities",null,null,null,null,null,null,null,null,0,0]
["Road transport",null,{"$f":"SUM(C88:C93)","v":11461019},{"$f":"SUM(D88:D93)","v":0},0,0,0,0,14600000,14600000,26061019,{"$f":"SUM(L88:L93)","v":27754985},{"$f":"SUM(M88:M93)","v":29559059}]
["Police Forces, Traffic and Street Parking Control",null,11461019,null,null,null,null,null,14600000,14600000,26061019,27754985,29559059]
["Pounds",null,null,null,null,null,null,null,null,0,0]
["Public Transport",null,null,null,null,null,null,null,null,0,0]
["Road and Traffic Regulation",null,null,null,null,null,null,null,null,0,0]
["Roads",null,null,null,null,null,null,null,null,0,0]
["Taxi Ranks",null,null,null,null,null,null,null,null,0,0]
["Environmental protection",null,{"$f":"SUM(C95:C100)","v":0},{"$f":"SUM(D95:D100)","v":0},0,0,0,0,0,0,0,{"$f":"SUM(L95:L100)","v":0},{"$f":"SUM(M95:M100)","v":0}]
["Biodiversity and Landscape",null,null,null,null,null,null,null,null,0,0]
["Coastal Protection",null,null,null,null,null,null,null,null,0,0]
["Indigenous Forests",null,null,null,null,null,null,null,null,0,0]
["Nature Conservation",null,null,null,null,null,null,null,null,0,0]
["Pollution Control",null,null,null,null,null,null,null,null,0,0]
["Soil Conservation",null,null,null,null,null,null,null,null,0,0]
["Trading services",null,{"$f":"C102+C106+C110+C115","v":25051354.469999999},{"$f":"D102+D106+D110+D115","v":0},0,0,0,0,16422987,16422987,41474341.469999999,44386277,48445111]
["Energy sources",null,{"$f":"SUM(C103:C105)","v":18807957.469999999},{"$f":"SUM(D103:D105)","v":0},0,0,0,0,14422987,14422987,33230944.469999999,{"$f":"SUM(L103:L105)","v":36672060},{"$f":"SUM(M103:M105)","v":40229469}]
["Electricity ",null,18807957.469999999,null,null,null,null,null,{"$f":"9800000+1822987+800000+2000000","v":14422987},14422987,33230944.469999999,36672060,40229469]
["Street Lighting and Signal Systems",null,null,null,null,null,null,null,null,0,0]
["Nonelectric Energy",null,null,null,null,null,null,null,null,0,0]
["Water management",null,{"$f":"SUM(C107:C109)","v":0},{"$f":"SUM(D107:D109)","v":0},0,0,0,0,0,0,0,{"$f":"SUM(L107:L109)","v":0},{"$f":"SUM(M107:M109)","v":0}]
["Water Treatment",null,null,null,null,null,null,null,null,0,0]
["Water Distribution",null,null,null,null,null,null,null,null,0,0]
["Water Storage",null,null,null,null,null,null,null,null,0,0]
["Waste water management",null,{"$f":"SUM(C111:C114)","v":0},{"$f":"SUM(D111:D114)","v":0},0,0,0,0,0,0,0,{"$f":"SUM(L111:L114)","v":0},{"$f":"SUM(M111:M114)","v":0}]
["Public Toilets",null,null,null,null,null,null,null,null,0,0]
["Sewerage",null,null,null,null,null,null,null,null,0,0]
["Storm Water Management",null,null,null,null,null,null,null,null,0,0]
["Waste Water Treatment",null,null,null,null,null,null,null,null,0,0]
["Waste management",null,{"$f":"SUM(C116:C119)","v":6243397},{"$f":"SUM(D116:D119)","v":0},0,0,0,0,2000000,2000000,8243397,7714217,{"$f":"SUM(M116:M119)","v":8215642}]
["Recycling",null,null,null,null,null,null,null,null,0,0]
["Solid Waste Disposal (Landfill Sites)",null,null,null,null,null,null,null,null,0,0]
["Solid Waste Removal",null,6243397,null,null,null,null,null,{"$f":"1000000+1000000","v":2000000},2000000,8243397,7714217,8215642]
["Street Cleaning",null,null,null,null,null,null,null,null,0,0]
["Other",null,{"$f":"SUM(C121:C126)","v":0},0,0,0,0,0,0,0,0,0,0]
["Abattoirs",null,null,null,null,null,null,null,null,0,0]
["Air Transport",null,null,null,null,null,null,null,null,0,0]
["Forestry ",null,null,null,null,null,null,null,null,0,0]
["Licensing and Regulation",null,null,null,null,null,null,null,null,0,0]
["Markets",null,null,null,null,null,null,null,null,0,0]
["Tourism",null,null,null,null,null,null,null,null,0,0]
[{"$f":"\"Total \"&A6","v":"Total Revenue - Functional"},2,{"$f":"C7+C28+C75+C101+C120","v":402707680.44000006},{"$f":"D7+D28+D75+D101+D120","v":0},0,0,0,0,46417201,46417201,449124881.44000006,456237483,491832071.5]
[null,null,null,null,null,null,null,null,null,0,0]
["Expenditure - Functional",null,null,null,null,null,null,null,null,0,0]
[{"$f":"A7","v":"Municipal governance and administration"},null,{"$f":"C131+C134+C149","v":124146230.87999998},0,0,0,0,0,21605438,21605438,145751668.88,{"$f":"L131+L134+L149","v":156319101},{"$f":"M131+M134+M149","v":166179736}]
[{"$f":"A8","v":"Executive and council"},null,{"$f":"SUM(C132:C133)","v":47800391.169999994},0,0,0,0,0,4582728,4582728,52383119.169999994,{"$f":"SUM(L132:L133)","v":56492940},{"$f":"SUM(M132:M133)","v":60004430}]
[{"$f":"A9","v":"Mayor and Council"},null,39561229.979999997,null,null,null,null,null,3700272,3700272,43261501.979999997,46774124,49653891]
[{"$f":"A10","v":"Municipal Manager, Town Secretary and Chief Executive"},null,8239161.1900000004,null,null,null,null,null,882456,882456,9121617.1900000013,9718816,10350539]
[{"$f":"A11","v":"Finance and administration"},null,{"$f":"SUM(C135:C148)","v":74406900.689999998},0,0,0,0,0,16494696,16494696,90901596.689999998,{"$f":"SUM(L135:L148)","v":97198856},{"$f":"SUM(M135:M148)","v":103377226}]
["Administrative and Corporate Support",null,20206768.219999999,null,null,null,null,null,972091,972091,21178859.219999999,22555485,24021591]
["Asset Management",null,4087160.29,null,null,null,null,null,189245,189245,4276405.29,4554372,4850406]
["Budget and Treasury Office",null,23968834.34,null,null,null,null,null,7797348,7797348,31766182.34,34223934,36308935]
["Finance",null,0,null,null,null,null,null,null,{"$f":"SUM(E138:I138)","v":0},{"$f":"IF(D138=0,C138+J138,D138+J138)","v":0},0,0]
["Fleet Management",null,0,null,null,null,null,null,null,0,0,0,0]
["Human Resources",null,6977174.9299999997,null,null,null,null,null,1085365,1085365,8062539.9299999997,8586605,9144735]
["Information Technology",null,6403449.8200000003,null,null,null,null,null,-964704,-964704,5438745.8200000003,5787970,6164188]
["Legal Services",null,4346185.0999999996,null,null,null,null,null,2744083,2744083,7090268.0999999996,7551135,8041959]
["Marketing, Customer Relations, Publicity and Media Co-ordination",null,2151894.46,null,null,null,null,null,0,0,2151894.46,2291767,2440732]
["Property Services",null,3136452,null,null,null,null,null,4463160,4463160,7599612,8093587,8619670]
["Risk Management",null,847756.79,null,null,null,null,null,17107,17107,864863.79,921080,980950]
["Security Services",null,0,null,null,null,null,null,0,0,0,0,0]
["Supply Chain Management ",null,2281224.7400000002,null,null,null,null,null,191001,191001,2472225.7400000002,2632921,2804060]
["Valuation Service",null,0,null,null,null,null,null,null,0,0,0,0]
[{"$f":"A26","v":"Internal audit"},null,{"$f":"SUM(C150:C150)","v":1938939.02},0,0,0,0,0,528014,528014,2466953.02,2627305,2798080]
[{"$f":"A27","v":"Governance Function"},null,1938939.02,null,null,null,null,null,528014,528014,2466953.02,2627305,2798080]
[{"$f":"A28","v":"Community and public safety"},null,{"$f":"C152+C174+C180+C187+C190","v":12752759.719999999},0,0,0,0,0,5320886,5320886,18073645.719999999,{"$f":"L152+L174+L180+L187+L190","v":19248432},{"$f":"M152+M174+M180+M187+M190","v":20499580}]
[{"$f":"A29","v":"Community and social services"},null,{"$f":"SUM(C153:C173)","v":4334295.18},0,0,0,0,0,681923,681923,5016218.18,{"$f":"SUM(L153:L173)","v":5342273},{"$f":"SUM(M153:M173)","v":5689520}]
[{"$f":"A30","v":"Aged Care"},null,null,null,null,null,null,null,null,0,0,0,0]
[{"$f":"A31","v":"Agricultural"},null,null,null,null,null,null,null,null,0,0,0,0]
["Animal Care and Diseases",null,null,null,null,null,null,null,null,0,0,0,0]
["Cemeteries, Funeral Parlours and Crematoriums",null,257880.39,null,null,null,null,null,-1318,-1318,256562.39,273239,290999]
["Child Care Facilities",null,0,null,null,null,null,null,null,0,0]
["Community Halls and Facilities",null,1484481.45,null,null,null,null,null,18320,18320,1502801.45,1600484,1704516]
["Consumer Protection",null,0,null,null,null,null,null,null,0,0,0,0]
["Cultural Matters",null,0,null,null,null,null,null,null,0,0,0,0]
["Disaster Management",null,1038276.39,null,null,null,null,null,109241,109241,1147517.3900000001,1222106,1301542]
["Education",null,0,null,null,null,null,null,null,0,0,0,0]
["Indigenous and Customary Law",null,0,null,null,null,null,null,null,0,0,0,0]
["Industrial Promotion",null,0,null,null,null,null,null,null,0,0,0,0]
["Language Policy",null,0,null,null,null,null,null,null,0,0,0,0]
["Libraries and Archives",null,1553656.95,null,null,null,null,null,555680,555680,2109336.9500000002,2246444,2392463]
["Literacy Programmes",null,null,null,null,null,null,null,null,0,0,0,0]
["Media Services",null,null,null,null,null,null,null,null,0,0]
["Museums and Art Galleries",null,null,null,null,null,null,null,null,0,0]
["Population Development",null,null,null,null,null,null,null,null,0,0]
["Provincial Cultural Matters",null,null,null,null,null,null,null,null,0,0]
["Theatres",null,null,null,null,null,null,null,null,0,0]
["Zoo's",null,null,null,null,null,null,null,null,0,0]
["Sport and recreation",null,{"$f":"SUM(C175:C179)","v":7690965.4299999997},0,0,0,0,0,4638963,4638963,12329928.43,{"$f":"SUM(L175:L179)","v":13131373},{"$f":"SUM(M175:M179)","v":13984913}]
["Beaches and Jetties ",null,null,null,null,null,null,null,null,0,0]
["Casinos, Racing, Gambling, Wagering",null,null,null,null,null,null,null,null,0,0]
["Community Parks (including Nurseries)",null,7690965.4299999997,null,null,null,null,null,4638963,4638963,12329928.43,13131373,13984913]
["Recreational Facilities",null,null,null,null,null,null,null,null,0,0]
["Sports Grounds and Stadiums",null,null,null,null,null,null,null,null,0,0]
["Public safety",null,{"$f":"SUM(C181:C186)","v":0},0,0,0,0,0,0,0,0,{"$f":"SUM(L181:L186)","v":0},{"$f":"SUM(M181:M186)","v":0}]
["Civil Defence",null,null,null,null,null,null,null,null,0,0]
["Cleansing",null,null,null,null,null,null,null,null,0,0]
["Control of Public Nuisances",null,null,null,null,null,null,null,null,0,0]
["Fencing and Fences ",null,null,null,null,null,null,null,null,0,0]
["Fire Fighting and Protection",null,null,null,null,null,null,null,null,0,0]
["Licensing and Control of Animals",null,null,null,null,null,null,null,null,0,0]
[{"$f":"A64","v":"Housing"},null,{"$f":"SUM(C188:C189)","v":727499.11},{"$f":"SUM(D188:D189)","v":0},0,0,0,0,0,0,727499.11,774786,825147]
[{"$f":"A65","v":"Housing"},null,727499.11,null,null,null,null,null,0,0,727499.11,774786,825147]
[{"$f":"A66","v":"Informal Settlements"},null,null,null,null,null,null,null,null,0,0]
["Health",null,{"$f":"SUM(C191:C197)","v":0},0,0,0,0,0,0,0,0,{"$f":"SUM(L191:L197)","v":0},{"$f":"SUM(M191:M197)","v":0}]
["Ambulance",null,null,null,null,null,null,null,null,0,0]
["Health Services",null,null,null,null,null,null,null,null,0,0]
["Laboratory Services",null,null,null,null,null,null,null,null,0,0]
["Food Control",null,null,null,null,null,null,null,null,0,0]
["Health Surveillance and Prevention of Communicable Diseases including immunizations",null,null,null,null,null,null,null,null,0,0]
["Vector Control",null,null,null,null,null,null,null,null,0,0]
["Chemical Safety",null,null,null,null,null,null,null,null,0,0]
[{"$f":"A75","v":"Economic and environmental services"},null,{"$f":"C199+C210+C217","v":48381784.74000001},0,0,0,0,0,17036145,17036145,65417929.74000001,{"$f":"L199+L210+L217","v":57055622},{"$f":"M199+M210+M217","v":60718751}]
[{"$f":"A76","v":"Planning and development"},null,{"$f":"SUM(C200:C209)","v":13504109.48},0,0,0,0,0,-1917559,-1917559,11586550.48,{"$f":"SUM(L200:L209)","v":12339676},{"$f":"SUM(M200:M209)","v":13141754}]
[{"$f":"A77","v":"Billboards"},null,null,null,null,null,null,null,null,0,0]
["Corporate Wide Strategic Planning (IDPs, LEDs)",null,8839649.2400000002,null,null,null,null,null,-3218341,-3218341,5621308.2400000002,4996383,5321147]
["Central City Improvement District",null,null,null,null,null,null,null,null,{"$f":"SUM(E202:I202)","v":0},{"$f":"IF(D202=0,C202+J202,D202+J202)","v":0}]
["Development Facilitation",null,null,null,null,null,null,null,null,0,0]
["Economic Development/Planning",null,null,null,null,null,null,null,null,0,0]
["Regional Planning and Development",null,null,null,null,null,null,null,null,0,0]
["Town Planning, Building Regulations and Enforcement, and City Engineer",null,2141460.2400000002,null,null,null,null,null,1034885,1034885,3176345.24,4373118,4657371]
["Project Management Unit",null,2523000,null,null,null,null,null,265897,265897,2788897,2970175,3163236]
["Provincial Planning",null,null,null,null,null,null,null,null,0,0]
["Support to Local Municipalities",null,null,null,null,null,null,null,null,0,0]
[{"$f":"A87","v":"Road transport"},null,{"$f":"SUM(C211:C216)","v":34877675.260000005},0,0,0,0,0,18953704,18953704,53831379.260000005,{"$f":"SUM(L211:L216)","v":44715946},{"$f":"SUM(M211:M216)","v":47576997}]
["Police Forces, Traffic and Street Parking Control",null,15612924.710000001,null,null,null,null,null,10123788,{"$f":"SUM(E211:I211)","v":10123788},25736712.710000001,27409599,29191223]
["Pounds",null,null,null,null,null,null,null,null,0,0,0,0]
["Public Transport",null,null,null,null,null,null,null,null,0,0,0,0]
["Road and Traffic Regulation",null,null,null,null,null,null,null,null,0,0,0,0]
["Roads",null,19031539.850000001,null,null,null,null,null,8590631,8590631,27622170.850000001,16803139,17849857]
["Taxi Ranks",null,233210.7,null,null,null,null,null,239285,239285,472495.7,503208,535917]
["Environmental protection",null,{"$f":"SUM(C218:C223)","v":0},0,0,0,0,0,0,0,0,{"$f":"SUM(L218:L223)","v":0},{"$f":"SUM(M218:M223)","v":0}]
["Biodiversity and Landscape",null,null,null,null,null,null,null,null,0,0]
["Coastal Protection",null,null,null,null,null,null,null,null,0,0]
["Indigenous Forests",null,null,null,null,null,null,null,null,0,0]
["Nature Conservation",null,null,null,null,null,null,null,null,0,0]
["Pollution Control",null,null,null,null,null,null,null,null,0,0]
["Soil Conservation",null,null,null,null,null,null,null,null,0,0]
["Trading services",null,{"$f":"C225+C229+C233+C238","v":38149586.189999998},{"$f":"D225+D229+D233+D238","v":0},0,0,0,0,8070636,8070636,46220222.189999998,49224534,52424129]
["Energy sources",null,{"$f":"SUM(C226:C228)","v":32487354.719999999},0,0,0,0,0,7962807,7962807,40450161.719999999,{"$f":"SUM(L226:L228)","v":43079420},{"$f":"SUM(M226:M228)","v":45879583}]
["Electricity ",null,24676142.140000001,null,null,null,null,null,9762331,9762331,34438473.140000001,36676973,39060977]
["Street Lighting and Signal Systems",null,7811212.5800000001,null,null,null,null,null,-1799524,-1799524,6011688.5800000001,6402447,6818606]
["Nonelectric Energy",null,null,null,null,null,null,null,null,0,0]
["Water management",null,{"$f":"SUM(C230:C232)","v":0},0,0,0,0,0,0,0,0,{"$f":"SUM(L230:L232)","v":0},{"$f":"SUM(M230:M232)","v":0}]
["Water Treatment",null,null,null,null,null,null,null,null,0,0]
["Water Distribution",null,null,null,null,null,null,null,null,0,0]
["Water Storage",null,null,null,null,null,null,null,null,0,0]
["Waste water management",null,{"$f":"SUM(C234:C237)","v":686133},0,0,0,0,0,14324,14324,700457,{"$f":"SUM(L234:L237)","v":745986},{"$f":"SUM(M234:M237)","v":794475}]
["Public Toilets",null,686133,null,null,null,null,null,14324,14324,700457,745986,794475]
["Sewerage",null,null,null,null,null,null,null,null,0,0]
["Storm Water Management",null,null,null,null,null,null,null,null,0,0]
["Waste Water Treatment",null,null,null,null,null,null,null,null,0,0]
["Waste management",null,{"$f":"SUM(C239:C242)","v":4976098.47},{"$f":"SUM(D239:D242)","v":0},{"$f":"SUM(E239:E242)","v":0},{"$f":"SUM(F239:F242)","v":0},0,0,93505,93505,5069603.47,5399128,5750071]
["Recycling",null,null,null,null,null,null,null,null,0,0]
["Solid Waste Disposal (Landfill Sites)",null,null,null,null,null,null,null,null,0,0]
["Solid Waste Removal",null,4976098.47,null,null,null,null,null,93505,93505,5069603.47,5399128,5750071]
["Street Cleaning",null,null,null,null,null,null,null,null,0,0]
[{"$f":"A120","v":"Other"},null,{"$f":"SUM(C244:C249)","v":0},{"$f":"SUM(D244:D249)","v":0},0,0,0,0,0,0,0,{"$f":"SUM(L244:L249)","v":0},{"$f":"SUM(M244:M249)","v":0}]
["Abattoirs",null,null,null,null,null,null,null,null,0,0]
["Air Transport",null,null,null,null,null,null,null,null,0,0]
["Forestry ",null,null,null,null,null,null,null,null,0,0]
["Licensing and Regulation",null,null,null,null,null,null,null,null,0,0]
["Markets",null,null,null,null,null,null,null,null,0,0]
["Tourism",null,null,null,null,null,null,null,null,0,0]
[{"$f":"\"Total \"&A129","v":"Total Expenditure - Functional"},3,{"$f":"C130+C151+C198+C224+C243","v":223430361.52999997},0,0,0,0,0,52033105,52033105,275463466.52999997,281847689,299822196]
[{"$f":"result","v":"Surplus/ (Deficit) for the year"},null,{"$f":"C127-C250","v":179277318.91000009},0,0,0,0,0,-5615904,-5615904,173661414.91000009,174389794,192009875.5]
[{"$f":"head27a","v":"References"}]
["1. Government Finance Statistics Functions and Sub-functions are standardised to assist national and international accounts and comparison"]
["2. Total Revenue by Functional Classification must reconcile to total operating revenue shown in Financial Performance (revenue and expenditure)"]
["3. Total Expenditure by Functional Classification must reconcile to total operating expenditure shown in Financial Performance (revenue and expenditure)"]
["4. All amounts must be classified under a Functional classification. The GFS function 'Other' is only for Abbatoirs, Air Transport, Licensing and Regulation, Markets and Tourism - and if used must be supported by footnotes. Nothing else may be placed under 'Other'. Assign associate share to relevant classification"]

{"sheet":"B3-FinPerf V","index":9,"n_rows":55,"n_cols":13,"rows_kept":55,"cut":false,"hidden":false,"merged":[[51,0,51,12],[47,0,47,12],[49,0,49,12],[1,0,2,0],[1,1,4,1],[1,2,1,10],[44,0,44,12],[45,0,45,12],[46,0,46,12]]}
[{"$f":"muni&\" - \"&_ADJ2&\" - \"&Date","v":"LIM332 Greater Letaba - Table B3 Adjustments Budget Financial Performance (revenue and expenditure by municipal vote) - 27 February 2019"}]
[{"$f":"Vdesc","v":"Vote Description"},{"$f":"head27","v":"Ref"},{"$f":"Head2","v":"Budget Year 2018/19"},null,null,null,null,null,null,null,null,{"$f":"Head10","v":"Budget Year +1 2019/20"},{"$f":"Head11","v":"Budget Year +2 2020/21"}]
[null,null,{"$f":"Head6","v":"Original Budget"},{"$f":"Head54","v":"Prior Adjusted"},{"$f":"Head51","v":"Accum. Funds"},{"$f":"Head52","v":"Multi-year capital"},{"$f":"Head53","v":"Unfore. Unavoid."},{"$f":"Head55","v":"Nat. or Prov. Govt"},{"$f":"Head50","v":"Other Adjusts."},{"$f":"Head56","v":"Total Adjusts."},{"$f":"Head7","v":"Adjusted Budget"},{"$f":"Head7","v":"Adjusted Budget"},{"$f":"Head7","v":"Adjusted Budget"}]
["[Insert departmental structure etc]",null,null,3,4,5,6,7,8,9,10]
["R thousands",null,"A","A1","B","C","D","E","F","G","H"]
["Revenue by Vote",1]
[{"$f":"B3B!A7","v":"Vote 1 - Executive & Council"},null,{"$f":"B3B!C7","v":0},{"$f":"B3B!D7","v":0},{"$f":"B3B!E7","v":0},{"$f":"B3B!F7","v":0},{"$f":"B3B!G7","v":0},{"$f":"B3B!H7","v":0},{"$f":"B3B!I7","v":0},{"$f":"SUM(E7:I7)","v":0},{"$f":"IF(D7=0,C7+J7,D7+J7)","v":0},{"$f":"B3B!L7","v":0},{"$f":"B3B!M7","v":0}]
[{"$f":"B3B!A18","v":"Vote 2 - Finance and Administration"},null,{"$f":"B3B!C18","v":366195306.97000003},{"$f":"B3B!D18","v":0},{"$f":"B3B!E18","v":0},{"$f":"B3B!F18","v":0},{"$f":"B3B!G18","v":0},{"$f":"B3B!H18","v":0},{"$f":"B3B!I18","v":15394214},15394214,381589520.97000003,{"$f":"B3B!L18","v":384096221},{"$f":"B3B!M18","v":413827901.5}]
[{"$f":"B3B!A29","v":"Vote 3 - Internal Audit"},null,{"$f":"B3B!C29","v":0},{"$f":"B3B!D29","v":0},{"$f":"B3B!E29","v":0},{"$f":"B3B!F29","v":0},{"$f":"B3B!G29","v":0},{"$f":"B3B!H29","v":0},{"$f":"B3B!I29","v":0},0,0,{"$f":"B3B!L29","v":0},{"$f":"B3B!M29","v":0}]
[{"$f":"B3B!A40","v":"Vote 4 - Community and Public Safety"},null,{"$f":"B3B!C40","v":0},{"$f":"B3B!D40","v":0},{"$f":"B3B!E40","v":0},{"$f":"B3B!F40","v":0},{"$f":"B3B!G40","v":0},{"$f":"B3B!H40","v":0},{"$f":"B3B!I40","v":0},0,0,{"$f":"B3B!L40","v":0},{"$f":"B3B!M40","v":0}]
[{"$f":"B3B!A51","v":"Vote 5 - Sports and Recreation"},null,{"$f":"B3B!C51","v":0},{"$f":"B3B!D51","v":0},{"$f":"B3B!E51","v":0},{"$f":"B3B!F51","v":0},{"$f":"B3B!G51","v":0},{"$f":"B3B!H51","v":0},{"$f":"B3B!I51","v":0},0,0,{"$f":"B3B!L51","v":0},{"$f":"B3B!M51","v":0}]
[{"$f":"B3B!A62","v":"Vote 6 - Housing"},null,{"$f":"B3B!C62","v":0},{"$f":"B3B!D62","v":0},{"$f":"B3B!E62","v":0},{"$f":"B3B!F62","v":0},{"$f":"B3B!G62","v":0},{"$f":"B3B!H62","v":0},{"$f":"B3B!I62","v":0},0,0,{"$f":"B3B!L62","v":0},{"$f":"B3B!M62","v":0}]
[{"$f":"B3B!A73","v":"Vote 7 - Planning and development "},null,{"$f":"B3B!C73","v":0},{"$f":"B3B!D73","v":0},{"$f":"B3B!E73","v":0},{"$f":"B3B!F73","v":0},{"$f":"B3B!G73","v":0},{"$f":"B3B!H73","v":0},{"$f":"B3B!I73","v":0},0,0,{"$f":"B3B!L73","v":0},{"$f":"B3B!M73","v":0}]
[{"$f":"B3B!A84","v":"Vote 8 - Road Transport"},null,{"$f":"B3B!C84","v":11461019},{"$f":"B3B!D84","v":0},{"$f":"B3B!E84","v":0},{"$f":"B3B!F84","v":0},{"$f":"B3B!G84","v":0},{"$f":"B3B!H84","v":0},{"$f":"B3B!I84","v":14600000},14600000,26061019,{"$f":"B3B!L84","v":27754985},{"$f":"B3B!M84","v":29559059}]
[{"$f":"B3B!A95","v":"Vote 9 - Energy Sources"},null,{"$f":"B3B!C95","v":18807957.469999999},{"$f":"B3B!D95","v":0},{"$f":"B3B!E95","v":0},{"$f":"B3B!F95","v":0},{"$f":"B3B!G95","v":0},{"$f":"B3B!H95","v":0},{"$f":"B3B!I95","v":14422987},14422987,33230944.469999999,{"$f":"B3B!L95","v":36672060},{"$f":"B3B!M95","v":40229469}]
[{"$f":"B3B!A106","v":"Vote 10 - Waste Water Management"},null,{"$f":"B3B!C106","v":0},{"$f":"B3B!D106","v":0},{"$f":"B3B!E106","v":0},{"$f":"B3B!F106","v":0},{"$f":"B3B!G106","v":0},{"$f":"B3B!H106","v":0},{"$f":"B3B!I106","v":0},0,0,{"$f":"B3B!L106","v":0},{"$f":"B3B!M106","v":0}]
[{"$f":"B3B!A117","v":"Vote 11 - Waste Management"},null,{"$f":"B3B!C117","v":6243397},{"$f":"B3B!D117","v":0},{"$f":"B3B!E117","v":0},{"$f":"B3B!F117","v":0},{"$f":"B3B!G117","v":0},{"$f":"B3B!H117","v":0},{"$f":"B3B!I117","v":2000000},2000000,8243397,{"$f":"B3B!L117","v":7714217},{"$f":"B3B!M117","v":8215642}]
[{"$f":"B3B!A128","v":"Vote 12 - [NAME OF VOTE 12]"},null,{"$f":"B3B!C128","v":0},{"$f":"B3B!D128","v":0},{"$f":"B3B!E128","v":0},{"$f":"B3B!F128","v":0},{"$f":"B3B!G128","v":0},{"$f":"B3B!H128","v":0},{"$f":"B3B!I128","v":0},0,0,{"$f":"B3B!L128","v":0},{"$f":"B3B!M128","v":0}]
[{"$f":"B3B!A139","v":"Vote 13 - [NAME OF VOTE 13]"},null,{"$f":"B3B!C139","v":0},{"$f":"B3B!D139","v":0},{"$f":"B3B!E139","v":0},{"$f":"B3B!F139","v":0},{"$f":"B3B!G139","v":0},{"$f":"B3B!H139","v":0},{"$f":"B3B!I139","v":0},0,0,{"$f":"B3B!L139","v":0},{"$f":"B3B!M139","v":0}]
[{"$f":"B3B!A150","v":"Vote 14 - [NAME OF VOTE 14]"},null,{"$f":"B3B!C150","v":0},{"$f":"B3B!D150","v":0},{"$f":"B3B!E150","v":0},{"$f":"B3B!F150","v":0},{"$f":"B3B!G150","v":0},{"$f":"B3B!H150","v":0},{"$f":"B3B!I150","v":0},0,0,{"$f":"B3B!L150","v":0},{"$f":"B3B!M150","v":0}]
[{"$f":"B3B!A161","v":"Vote 15 - [NAME OF VOTE 15]"},null,{"$f":"B3B!C161","v":0},{"$f":"B3B!D161","v":0},{"$f":"B3B!E161","v":0},{"$f":"B3B!F161","v":0},{"$f":"B3B!G161","v":0},{"$f":"B3B!H161","v":0},{"$f":"B3B!I161","v":0},0,0,{"$f":"B3B!L161","v":0},{"$f":"B3B!M161","v":0}]
["Total Revenue by Vote",2,{"$f":"SUM(C7:C21)","v":402707680.44000006},{"$f":"SUM(D7:D21)","v":0},0,0,0,0,46417201,{"$f":"SUM(J7:J21)","v":46417201},449124881.44000006,{"$f":"SUM(L7:L21)","v":456237483},{"$f":"SUM(M7:M21)","v":491832071.5}]
[]
["Expenditure by Vote",1]
[{"$f":"B3B!A175","v":"Vote 1 - Executive & Council"},null,{"$f":"B3B!C175","v":47800391.169999994},{"$f":"B3B!D175","v":0},{"$f":"B3B!E175","v":0},{"$f":"B3B!F175","v":0},{"$f":"B3B!G175","v":0},{"$f":"B3B!H175","v":0},{"$f":"B3B!I175","v":4582730},{"$f":"SUM(E25:I25)","v":4582730},{"$f":"IF(D25=0,C25+J25,D25+J25)","v":52383121.169999994},{"$f":"B3B!L175","v":56492940},{"$f":"B3B!M175","v":60004430}]
[{"$f":"B3B!A186","v":"Vote 2 - Finance and Administration"},null,{"$f":"B3B!C186","v":74406900.689999998},{"$f":"B3B!D186","v":0},{"$f":"B3B!E186","v":0},{"$f":"B3B!F186","v":0},{"$f":"B3B!G186","v":0},{"$f":"B3B!H186","v":0},{"$f":"B3B!I186","v":16494809},16494809,90901709.689999998,{"$f":"B3B!L186","v":97198856},{"$f":"B3B!M186","v":103377226}]
[{"$f":"B3B!A197","v":"Vote 3 - Internal Audit"},null,{"$f":"B3B!C197","v":1938939.02},{"$f":"B3B!D197","v":0},{"$f":"B3B!E197","v":0},{"$f":"B3B!F197","v":0},{"$f":"B3B!G197","v":0},{"$f":"B3B!H197","v":0},{"$f":"B3B!I197","v":528014},528014,2466953.02,{"$f":"B3B!L197","v":2627305},{"$f":"B3B!M197","v":2798080}]
[{"$f":"B3B!A208","v":"Vote 4 - Community and Public Safety"},null,{"$f":"B3B!C208","v":4334295.18},{"$f":"B3B!D208","v":0},{"$f":"B3B!E208","v":0},{"$f":"B3B!F208","v":0},{"$f":"B3B!G208","v":0},{"$f":"B3B!H208","v":0},{"$f":"B3B!I208","v":681923},681923,5016218.18,{"$f":"B3B!L208","v":5342273},{"$f":"B3B!M208","v":5689520}]
[{"$f":"B3B!A219","v":"Vote 5 - Sports and Recreation"},null,{"$f":"B3B!C219","v":7690965.4299999997},{"$f":"B3B!D219","v":0},{"$f":"B3B!E219","v":0},{"$f":"B3B!F219","v":0},{"$f":"B3B!G219","v":0},{"$f":"B3B!H219","v":0},{"$f":"B3B!I219","v":4638963},4638963,12329928.43,{"$f":"B3B!L219","v":13131373},{"$f":"B3B!M219","v":13984913}]
[{"$f":"B3B!A230","v":"Vote 6 - Housing"},null,{"$f":"B3B!C230","v":727499.11},{"$f":"B3B!D230","v":0},{"$f":"B3B!E230","v":0},{"$f":"B3B!F230","v":0},{"$f":"B3B!G230","v":0},{"$f":"B3B!H230","v":0},{"$f":"B3B!I230","v":0},0,727499.11,{"$f":"B3B!L230","v":774786},{"$f":"B3B!M230","v":825147}]
[{"$f":"B3B!A241","v":"Vote 7 - Planning and development "},null,{"$f":"B3B!C241","v":13504109.48},{"$f":"B3B!D241","v":0},{"$f":"B3B!E241","v":0},{"$f":"B3B!F241","v":0},{"$f":"B3B!G241","v":0},{"$f":"B3B!H241","v":0},{"$f":"B3B!I241","v":-1917559},-1917559,11586550.48,{"$f":"B3B!L241","v":12339676},{"$f":"B3B!M241","v":13141754}]
[{"$f":"B3B!A252","v":"Vote 8 - Road Transport"},null,{"$f":"B3B!C252","v":34877675.260000005},{"$f":"B3B!D252","v":0},{"$f":"B3B!E252","v":0},{"$f":"B3B!F252","v":0},{"$f":"B3B!G252","v":0},{"$f":"B3B!H252","v":0},{"$f":"B3B!I252","v":18953704},18953704,53831379.260000005,{"$f":"B3B!L252","v":44715946},{"$f":"B3B!M252","v":47576997}]
[{"$f":"B3B!A263","v":"Vote 9 - Energy Sources"},null,{"$f":"B3B!C263","v":32487354.719999999},{"$f":"B3B!D263","v":0},{"$f":"B3B!E263","v":0},{"$f":"B3B!F263","v":0},{"$f":"B3B!G263","v":0},{"$f":"B3B!H263","v":0},{"$f":"B3B!I263","v":7962807},7962807,40450161.719999999,{"$f":"B3B!L263","v":43079420},{"$f":"B3B!M263","v":45879583}]
[{"$f":"B3B!A274","v":"Vote 10 - Waste Water Management"},null,{"$f":"B3B!C274","v":686133},{"$f":"B3B!D274","v":0},{"$f":"B3B!E274","v":0},{"$f":"B3B!F274","v":0},{"$f":"B3B!G274","v":0},{"$f":"B3B!H274","v":0},{"$f":"B3B!I274","v":14324},14324,700457,{"$f":"B3B!L274","v":745986},{"$f":"B3B!M274","v":794475}]
[{"$f":"B3B!A285","v":"Vote 11 - Waste Management"},null,{"$f":"B3B!C285","v":4976098.47},{"$f":"B3B!D285","v":0},{"$f":"B3B!E285","v":0},{"$f":"B3B!F285","v":0},{"$f":"B3B!G285","v":0},{"$f":"B3B!H285","v":0},{"$f":"B3B!I285","v":93505},93505,5069603.47,{"$f":"B3B!L285","v":5399128},{"$f":"B3B!M285","v":5750071}]
[{"$f":"B3B!A296","v":"Vote 12 - [NAME OF VOTE 12]"},null,{"$f":"B3B!C296","v":0},{"$f":"B3B!D296","v":0},{"$f":"B3B!E296","v":0},{"$f":"B3B!F296","v":0},{"$f":"B3B!G296","v":0},{"$f":"B3B!H296","v":0},{"$f":"B3B!I296","v":0},0,0,{"$f":"B3B!L296","v":0},{"$f":"B3B!M296","v":0}]
[{"$f":"B3B!A307","v":"Vote 13 - [NAME OF VOTE 13]"},null,{"$f":"B3B!C307","v":0},{"$f":"B3B!D307","v":0},{"$f":"B3B!E307","v":0},{"$f":"B3B!F307","v":0},{"$f":"B3B!G307","v":0},{"$f":"B3B!H307","v":0},{"$f":"B3B!I307","v":0},0,0,{"$f":"B3B!L307","v":0},{"$f":"B3B!M307","v":0}]
[{"$f":"B3B!A318","v":"Vote 14 - [NAME OF VOTE 14]"},null,{"$f":"B3B!C318","v":0},{"$f":"B3B!D318","v":0},{"$f":"B3B!E318","v":0},{"$f":"B3B!F318","v":0},{"$f":"B3B!G318","v":0},{"$f":"B3B!H318","v":0},{"$f":"B3B!I318","v":0},0,0,{"$f":"B3B!L318","v":0},{"$f":"B3B!M318","v":0}]
[{"$f":"B3B!A329","v":"Vote 15 - [NAME OF VOTE 15]"},null,{"$f":"B3B!C329","v":0},{"$f":"B3B!D329","v":0},{"$f":"B3B!E329","v":0},{"$f":"B3B!F329","v":0},{"$f":"B3B!G329","v":0},{"$f":"B3B!H329","v":0},{"$f":"B3B!I329","v":0},0,0,{"$f":"B3B!L329","v":0},{"$f":"B3B!M329","v":0}]
["Total Expenditure by Vote",2,{"$f":"SUM(C25:C39)","v":223430361.52999997},{"$f":"SUM(D25:D39)","v":0},0,0,0,0,52033220,{"$f":"SUM(J25:J39)","v":52033220},{"$f":"SUM(K25:K39)","v":275463581.53000009},{"$f":"SUM(L25:L39)","v":281847689},{"$f":"SUM(M25:M39)","v":299822196}]
[{"$f":"result","v":"Surplus/ (Deficit) for the year"},2,{"$f":"C22-C40","v":179277318.91000009},{"$f":"D22-D40","v":0},0,0,0,0,-5616019,-5616019,173661299.90999997,174389794,192009875.5]
[{"$f":"head27a","v":"References"}]
["1. Insert 'Vote'; e.g. Department, if different to standard classification structure"]
["2. Must reconcile to Budgeted Financial Performance (revenue and expenditure)"]
["3. Only complete if a previous adjusted budget has been approved in the same financial year. Reflect most recent adjusted budget."]
["4. Additional cash-backed accumulated funds/unspent funds (MFMA section 18(1)(b) and section 28(2)(e)) identified after the Original Budget approved and after annual financial statements audited (note: only where underspending could not reasonably have been foreseen)"]
["5. Increases of funds approved under MFMA section 31"]
["6. Adjustments approved in accordance with MFMA section 29 "]
["7. Adjustments to transfers from National or Provincial Government"]
["8. Adjusts. = 'Other' Adjustments proposed to be approved; including revenue under-collection (MFMA section 28(2)(a)); additional revenue appropriation on existing programmes (section 28(2))(b); projected savings (section 28(2)(d)); error correction (section 28(2)(f))"]
["9. G = B + C + D + E + F"]
["10. Adjusted Budget H = (A or A1/2 etc) + G"]
[]
["check revenue",null,{"$f":"C22-'B4-FinPerf RE'!C62","v":8000.210000038147},{"$f":"D22-'B4-FinPerf RE'!D62","v":0},{"$f":"E22-'B4-FinPerf RE'!E62","v":0},{"$f":"F22-'B4-FinPerf RE'!F62","v":0},{"$f":"G22-'B4-FinPerf RE'!G62","v":0},{"$f":"H22-'B4-FinPerf RE'!H62","v":0},{"$f":"I22-'B4-FinPerf RE'!I62","v":-7999},{"$f":"J22-'B4-FinPerf RE'!J62","v":-7999},{"$f":"K22-'B4-FinPerf RE'!K62","v":1.2100000381469727},{"$f":"L22-'B4-FinPerf RE'!L62","v":902},{"$f":"M22-'B4-FinPerf RE'!M62","v":-6.5}]
["check expenditure",null,{"$f":"C40-'B4-FinPerf RE'!C37","v":0.16759997606277466},{"$f":"D40-'B4-FinPerf RE'!D37","v":0},{"$f":"E40-'B4-FinPerf RE'!E37","v":0},{"$f":"F40-'B4-FinPerf RE'!F37","v":0},{"$f":"G40-'B4-FinPerf RE'!G37","v":0},{"$f":"H40-'B4-FinPerf RE'!H37","v":0},{"$f":"I40-'B4-FinPerf RE'!I37","v":764.29999999701977},{"$f":"J40-'B4-FinPerf RE'!J37","v":764.29999999701977},{"$f":"K40-'B4-FinPerf RE'!K37","v":764.46760010719299},{"$f":"L40-'B4-FinPerf RE'!L37","v":122.72235000133514},{"$f":"M40-'B4-FinPerf RE'!M37","v":469.60434275865555}]

{"sheet":"B3B","index":10,"n_rows":346,"n_cols":13,"rows_kept":346,"cut":false,"hidden":false,"merged":[[1,0,2,0],[1,1,4,1],[1,2,1,10]]}
[{"$f":"muni&\" - \"&_ADJ2&\" - B\"&\" - \"&Date","v":"LIM332 Greater Letaba - Table B3 Adjustments Budget Financial Performance (revenue and expenditure by municipal vote) - B - 27 February 2019"}]
[{"$f":"Vdesc","v":"Vote Description"},{"$f":"head27","v":"Ref"},{"$f":"Head2","v":"Budget Year 2018/19"},null,null,null,null,null,null,null,null,{"$f":"Head10","v":"Budget Year +1 2019/20"},{"$f":"Head11","v":"Budget Year +2 2020/21"}]
[null,null,{"$f":"Head6","v":"Original Budget"},{"$f":"Head54","v":"Prior Adjusted"},{"$f":"Head51","v":"Accum. Funds"},{"$f":"Head52","v":"Multi-year capital"},{"$f":"Head53","v":"Unfore. Unavoid."},{"$f":"Head55","v":"Nat. or Prov. Govt"},{"$f":"Head50","v":"Other Adjusts."},{"$f":"Head56","v":"Total Adjusts."},{"$f":"Head7","v":"Adjusted Budget"},{"$f":"Head7","v":"Adjusted Budget"},{"$f":"Head7","v":"Adjusted Budget"}]
["[Insert departmental structure etc]",null,null,3,4,5,6,7,8,9,10]
["R thousands",null,"A","A1","B","C","D","E","F","G","H"]
["Revenue by Vote",1]
[{"$f":"'Org structure'!A2","v":"Vote 1 - Executive & Council"},null,{"$f":"SUM(C8:C17)","v":0},{"$f":"SUM(D8:D17)","v":0},0,0,0,0,0,{"$f":"SUM(E7:I7)","v":0},{"$f":"IF(D7=0,C7+J7,D7+J7)","v":0},{"$f":"SUM(L8:L17)","v":0},{"$f":"SUM(M8:M17)","v":0}]
[{"$f":"'Org structure'!E3","v":"1,1 - Mayor and Council"},null,null,null,null,null,null,null,null,{"$f":"SUM(E8:I8)","v":0},{"$f":"IF(D8=0,C8+J8,D8+J8)","v":0}]
[{"$f":"'Org structure'!E4","v":"1,2 - Municipal Manager"},null,null,null,null,null,null,null,null,0,0]
[{"$f":"'Org structure'!E5","v":0},null,null,null,null,null,null,null,null,0,0]
[{"$f":"'Org structure'!E6","v":0},null,null,null,null,null,null,null,null,0,0]
[{"$f":"'Org structure'!E7","v":0},null,null,null,null,null,null,null,null,0,0]
[{"$f":"'Org structure'!E8","v":0},null,null,null,null,null,null,null,null,0,0]
[{"$f":"'Org structure'!E9","v":0},null,null,null,null,null,null,null,null,0,0]
[{"$f":"'Org structure'!E10","v":0},null,null,null,null,null,null,null,null,0,0]
[{"$f":"'Org structure'!E11","v":0},null,null,null,null,null,null,null,null,0,0]
[{"$f":"'Org structure'!E12","v":0},null,null,null,null,null,null,null,null,0,0]
[{"$f":"'Org structure'!A3","v":"Vote 2 - Finance and Administration"},null,{"$f":"SUM(C19:C28)","v":366195306.97000003},{"$f":"SUM(D19:D28)","v":0},0,0,0,0,15394214,15394214,381589520.97000003,{"$f":"SUM(L19:L28)","v":384096221},{"$f":"SUM(M19:M28)","v":413827901.5}]
[{"$f":"'Org structure'!E14","v":"2,1 - Administrative and Corporate Support"},null,null,null,null,null,null,null,null,0,0]
[{"$f":"'Org structure'!E15","v":"2,2 - Asset Management"},null,null,null,null,null,null,null,null,0,0]
[{"$f":"'Org structure'!E16","v":"2,3 - Budget and Treasury Office"},null,366195306.97000003,null,null,null,null,null,15394214,15394214,381589520.97000003,{"$f":"386617221-2521000","v":384096221},{"$f":"417083255-3255353.5","v":413827901.5}]
[{"$f":"'Org structure'!E17","v":"2,4 - Human Resource"},null,null,null,null,null,null,null,null,0,0]
[{"$f":"'Org structure'!E18","v":"2,5 - Information Technology"},null,null,null,null,null,null,null,null,0,0]
[{"$f":"'Org structure'!E19","v":"2,6 - Legal Services"},null,null,null,null,null,null,null,null,0,0]
[{"$f":"'Org structure'!E20","v":"2,7 - Customer Relation and Coordination"},null,null,null,null,null,null,null,null,0,0]
[{"$f":"'Org structure'!E21","v":"2,8 - Property Services"},null,null,null,null,null,null,null,null,0,0]
[{"$f":"'Org structure'!E22","v":"2,9 - Risk Management"},null,null,null,null,null,null,null,null,0,0]
[{"$f":"'Org structure'!E23","v":"2.10 - Supply Chain Management"},null,null,null,null,null,null,null,null,0,0]
[{"$f":"'Org structure'!A4","v":"Vote 3 - Internal Audit"},null,{"$f":"SUM(C30:C39)","v":0},0,0,0,0,0,0,0,0,{"$f":"SUM(L30:L39)","v":0},{"$f":"SUM(M30:M39)","v":0}]
[{"$f":"'Org structure'!E25","v":"3,1 - Governance Function"},null,null,null,null,null,null,null,null,0,0]
[{"$f":"'Org structure'!E26","v":0},null,null,null,null,null,null,null,null,0,0]
[{"$f":"'Org structure'!E27","v":0},null,null,null,null,null,null,null,null,0,0]
[{"$f":"'Org structure'!E28","v":0},null,null,null,null,null,null,null,null,0,0]
[{"$f":"'Org structure'!E29","v":0},null,null,null,null,null,null,null,null,0,0]
[{"$f":"'Org structure'!E30","v":0},null,null,null,null,null,null,null,null,0,0]
[{"$f":"'Org structure'!E31","v":0},null,null,null,null,null,null,null,null,0,0]
[{"$f":"'Org structure'!E32","v":0},null,null,null,null,null,null,null,null,0,0]
[{"$f":"'Org structure'!E33","v":0},null,null,null,null,null,null,null,null,0,0]
[{"$f":"'Org structure'!E34","v":0},null,null,null,null,null,null,null,null,0,0]
[{"$f":"'Org structure'!A5","v":"Vote 4 - Community and Public Safety"},null,{"$f":"SUM(C41:C50)","v":0},0,0,0,0,0,0,0,0,{"$f":"SUM(L41:L50)","v":0},{"$f":"SUM(M41:M50)","v":0}]
[{"$f":"'Org structure'!E36","v":"4,1 - Cemetries and crematoriums"},null,null,null,null,null,null,null,null,0,0]
[{"$f":"'Org structure'!E37","v":"4,2 - Community halls and Facilities"},null,null,null,null,null,null,null,null,0,0]
[{"$f":"'Org structure'!E38","v":"4,3 - Disaster Management"},null,null,null,null,null,null,null,null,0,0]
[{"$f":"'Org structure'!E39","v":"4,4 - Libraries and Archives"},null,null,null,null,null,null,null,null,0,0]
[{"$f":"'Org structure'!E40","v":0},null,null,null,null,null,null,null,null,0,0]
[{"$f":"'Org structure'!E41","v":0},null,null,null,null,null,null,null,null,0,0]
[{"$f":"'Org structure'!E42","v":0},null,null,null,null,null,null,null,null,0,0]
[{"$f":"'Org structure'!E43","v":0},null,null,null,null,null,null,null,null,0,0]
[{"$f":"'Org structure'!E44","v":0},null,null,null,null,null,null,null,null,0,0]
[{"$f":"'Org structure'!E45","v":0},null,null,null,null,null,null,null,null,0,0]
[{"$f":"'Org structure'!A6","v":"Vote 5 - Sports and Recreation"},null,{"$f":"SUM(C52:C61)","v":0},{"$f":"SUM(D52:D61)","v":0},0,0,0,0,0,0,0,{"$f":"SUM(L52:L61)","v":0},{"$f":"SUM(M52:M61)","v":0}]
[{"$f":"'Org structure'!E47","v":"5,1 - Community parks"},null,null,null,null,null,null,null,null,0,0]
[{"$f":"'Org structure'!E48","v":0},null,null,null,null,null,null,null,null,0,0]
[{"$f":"'Org structure'!E49","v":0},null,null,null,null,null,null,null,null,0,0]
[{"$f":"'Org structure'!E50","v":0},null,null,null,null,null,null,null,null,0,0]
[{"$f":"'Org structure'!E51","v":0},null,null,null,null,null,null,null,null,0,0]
[{"$f":"'Org structure'!E52","v":0},null,null,null,null,null,null,null,null,0,0]
[{"$f":"'Org structure'!E53","v":0},null,null,null,null,null,null,null,null,0,0]
[{"$f":"'Org structure'!E54","v":0},null,null,null,null,null,null,null,null,0,0]
[{"$f":"'Org structure'!E55","v":0},null,null,null,null,null,null,null,null,0,0]
[{"$f":"'Org structure'!E56","v":0},null,null,null,null,null,null,null,null,0,0]
[{"$f":"'Org structure'!A7","v":"Vote 6 - Housing"},null,{"$f":"SUM(C63:C72)","v":0},{"$f":"SUM(D63:D72)","v":0},0,0,0,0,0,0,0,{"$f":"SUM(L63:L72)","v":0},{"$f":"SUM(M63:M72)","v":0}]
[{"$f":"'Org structure'!E58","v":"6,1 - Housing"},null,null,null,null,null,null,null,null,0,0]
[{"$f":"'Org structure'!E59","v":0},null,null,null,null,null,null,null,null,0,0]
[{"$f":"'Org structure'!E60","v":0},null,null,null,null,null,null,null,null,0,0]
[{"$f":"'Org structure'!E61","v":0},null,null,null,null,null,null,null,null,0,0]
[{"$f":"'Org structure'!E62","v":0},null,null,null,null,null,null,null,null,0,0]
[{"$f":"'Org structure'!E63","v":0},null,null,null,null,null,null,null,null,0,0]
[{"$f":"'Org structure'!E64","v":0},null,null,null,null,null,null,null,null,0,0]
[{"$f":"'Org structure'!E65","v":0},null,null,null,null,null,null,null,null,0,0]
[{"$f":"'Org structure'!E66","v":0},null,null,null,null,null,null,null,null,0,0]
[{"$f":"'Org structure'!E67","v":0},null,null,null,null,null,null,null,null,{"$f":"SUM(E72:I72)","v":0},{"$f":"IF(D72=0,C72+J72,D72+J72)","v":0}]
[{"$f":"'Org structure'!A8","v":"Vote 7 - Planning and development "},null,{"$f":"SUM(C74:C83)","v":0},0,0,0,0,0,0,0,0,{"$f":"SUM(L74:L83)","v":0},{"$f":"SUM(M74:M83)","v":0}]
[{"$f":"'Org structure'!E69","v":"7,1 - Corporate Wide Strategic Planning (IDP & LED)"},null,null,null,null,null,null,null,null,0,0]
[{"$f":"'Org structure'!E70","v":"7,2 - Town Planning and Building Regulations"},null,null,null,null,null,null,null,null,0,0]
[{"$f":"'Org structure'!E71","v":"7,3 - Project Management Unit"},null,null,null,null,null,null,null,null,0,0]
[{"$f":"'Org structure'!E72","v":0},null,null,null,null,null,null,null,null,0,0]
[{"$f":"'Org structure'!E73","v":0},null,null,null,null,null,null,null,null,0,0]
[{"$f":"'Org structure'!E74","v":0},null,null,null,null,null,null,null,null,0,0]
[{"$f":"'Org structure'!E75","v":0},null,null,null,null,null,null,null,null,0,0]
[{"$f":"'Org structure'!E76","v":0},null,null,null,null,null,null,null,null,0,0]
[{"$f":"'Org structure'!E77","v":0},null,null,null,null,null,null,null,null,0,0]
[{"$f":"'Org structure'!E78","v":0},null,null,null,null,null,null,null,null,0,0]
[{"$f":"'Org structure'!A9","v":"Vote 8 - Road Transport"},null,{"$f":"SUM(C85:C94)","v":11461019},{"$f":"SUM(D85:D94)","v":0},0,0,0,0,14600000,14600000,26061019,{"$f":"SUM(L85:L94)","v":27754985},{"$f":"SUM(M85:M94)","v":29559059}]
[{"$f":"'Org structure'!E80","v":"8,1 - Road and Traffic Regulations"},null,11461019,null,null,null,null,null,14600000,14600000,26061019,27754985,29559059]
[{"$f":"'Org structure'!E81","v":"8,2 - Roads"},null,null,null,null,null,null,null,null,0,0]
[{"$f":"'Org structure'!E82","v":"8,3 - Taxi Ranks"},null,null,null,null,null,null,null,null,0,0]
[{"$f":"'Org structure'!E83","v":0},null,null,null,null,null,null,null,null,0,0]
[{"$f":"'Org structure'!E84","v":0},null,null,null,null,null,null,null,null,0,0]
[{"$f":"'Org structure'!E85","v":0},null,null,null,null,null,null,null,null,0,0]
[{"$f":"'Org structure'!E86","v":0},null,null,null,null,null,null,null,null,0,0]
[{"$f":"'Org structure'!E87","v":0},null,null,null,null,null,null,null,null,0,0]
[{"$f":"'Org structure'!E88","v":0},null,null,null,null,null,null,null,null,0,0]
[{"$f":"'Org structure'!E89","v":0},null,null,null,null,null,null,null,null,0,0]
[{"$f":"'Org structure'!A10","v":"Vote 9 - Energy Sources"},null,{"$f":"SUM(C96:C105)","v":18807957.469999999},{"$f":"SUM(D96:D105)","v":0},0,0,0,0,14422987,14422987,33230944.469999999,{"$f":"SUM(L96:L105)","v":36672060},{"$f":"SUM(M96:M105)","v":40229469}]
[{"$f":"'Org structure'!E91","v":"9,1 - Electricity"},null,18807957.469999999,null,null,null,null,null,{"$f":"9800000+1822987+800000+2000000","v":14422987},14422987,33230944.469999999,36672060,40229469]
[{"$f":"'Org structure'!E92","v":"9,2 - Street Lighting"},null,null,null,null,null,null,null,null,0,0]
[{"$f":"'Org structure'!E93","v":0},null,null,null,null,null,null,null,null,0,0]
[{"$f":"'Org structure'!E94","v":0},null,null,null,null,null,null,null,null,0,0]
[{"$f":"'Org structure'!E95","v":0},null,null,null,null,null,null,null,null,0,0]
[{"$f":"'Org structure'!E96","v":0},null,null,null,null,null,null,null,null,0,0]
[{"$f":"'Org structure'!E97","v":0},null,null,null,null,null,null,null,null,0,0]
[{"$f":"'Org structure'!E98","v":0},null,null,null,null,null,null,null,null,0,0]
[{"$f":"'Org structure'!E99","v":0},null,null,null,null,null,null,null,null,0,0]
[{"$f":"'Org structure'!E100","v":0},null,null,null,null,null,null,null,null,0,0]
[{"$f":"'Org structure'!A11","v":"Vote 10 - Waste Water Management"},null,{"$f":"SUM(C107:C116)","v":0},{"$f":"SUM(D107:D116)","v":0},0,0,0,0,0,0,0,{"$f":"SUM(L107:L116)","v":0},{"$f":"SUM(M107:M116)","v":0}]
[{"$f":"'Org structure'!E102","v":"10,1 - Public Toilets"},null,null,null,null,null,null,null,null,0,0]
[{"$f":"'Org structure'!E103","v":0},null,null,null,null,null,null,null,null,0,0]
[{"$f":"'Org structure'!E104","v":0},null,null,null,null,null,null,null,null,0,0]
[{"$f":"'Org structure'!E105","v":0},null,null,null,null,null,null,null,null,0,0]
[{"$f":"'Org structure'!E106","v":0},null,null,null,null,null,null,null,null,0,0]
[{"$f":"'Org structure'!E107","v":0},null,null,null,null,null,null,null,null,0,0]
[{"$f":"'Org structure'!E108","v":0},null,null,null,null,null,null,null,null,0,0]
[{"$f":"'Org structure'!E109","v":0},null,null,null,null,null,null,null,null,0,0]
[{"$f":"'Org structure'!E110","v":0},null,null,null,null,null,null,null,null,0,0]
[{"$f":"'Org structure'!E111","v":0},null,null,null,null,null,null,null,null,0,0]
[{"$f":"'Org structure'!A12","v":"Vote 11 - Waste Management"},null,{"$f":"SUM(C118:C127)","v":6243397},{"$f":"SUM(D118:D127)","v":0},0,0,0,0,2000000,2000000,8243397,{"$f":"SUM(L118:L127)","v":7714217},{"$f":"SUM(M118:M127)","v":8215642}]
[{"$f":"'Org structure'!E113","v":"11,1 - Solid Waste Removal"},null,6243397,null,null,null,null,null,2000000,2000000,8243397,7714217,8215642]
[{"$f":"'Org structure'!E114","v":0},null,null,null,null,null,null,null,null,0,0]
[{"$f":"'Org structure'!E115","v":0},null,null,null,null,null,null,null,null,0,0]
[{"$f":"'Org structure'!E116","v":0},null,null,null,null,null,null,null,null,0,0]
[{"$f":"'Org structure'!E117","v":0},null,null,null,null,null,null,null,null,0,0]
[{"$f":"'Org structure'!E118","v":0},null,null,null,null,null,null,null,null,0,0]
[{"$f":"'Org structure'!E119","v":0},null,null,null,null,null,null,null,null,0,0]
[{"$f":"'Org structure'!E120","v":0},null,null,null,null,null,null,null,null,0,0]
[{"$f":"'Org structure'!E121","v":0},null,null,null,null,null,null,null,null,0,0]
[{"$f":"'Org structure'!E122","v":0},null,null,null,null,null,null,null,null,0,0]
[{"$f":"'Org structure'!A13","v":"Vote 12 - [NAME OF VOTE 12]"},null,{"$f":"SUM(C129:C138)","v":0},{"$f":"SUM(D129:D138)","v":0},0,0,0,0,0,0,0,{"$f":"SUM(L129:L138)","v":0},{"$f":"SUM(M129:M138)","v":0}]
[{"$f":"'Org structure'!E124","v":"12.1 - [Name of sub-vote]"},null,null,null,null,null,null,null,null,0,0]
[{"$f":"'Org structure'!E125","v":0},null,null,null,null,null,null,null,null,0,0]
[{"$f":"'Org structure'!E126","v":0},null,null,null,null,null,null,null,null,0,0]
[{"$f":"'Org structure'!E127","v":0},null,null,null,null,null,null,null,null,0,0]
[{"$f":"'Org structure'!E128","v":0},null,null,null,null,null,null,null,null,0,0]
[{"$f":"'Org structure'!E129","v":0},null,null,null,null,null,null,null,null,0,0]
[{"$f":"'Org structure'!E130","v":0},null,null,null,null,null,null,null,null,0,0]
[{"$f":"'Org structure'!E131","v":0},null,null,null,null,null,null,null,null,{"$f":"SUM(E136:I136)","v":0},{"$f":"IF(D136=0,C136+J136,D136+J136)","v":0}]
[{"$f":"'Org structure'!E132","v":0},null,null,null,null,null,null,null,null,0,0]
[{"$f":"'Org structure'!E133","v":0},null,null,null,null,null,null,null,null,0,0]
[{"$f":"'Org structure'!A14","v":"Vote 13 - [NAME OF VOTE 13]"},null,{"$f":"SUM(C140:C149)","v":0},{"$f":"SUM(D140:D149)","v":0},0,0,0,0,0,0,0,{"$f":"SUM(L140:L149)","v":0},{"$f":"SUM(M140:M149)","v":0}]
[{"$f":"'Org structure'!E135","v":"13.1 - [Name of sub-vote]"},null,null,null,null,null,null,null,null,0,0]
[{"$f":"'Org structure'!E136","v":0},null,null,null,null,null,null,null,null,0,0]
[{"$f":"'Org structure'!E137","v":0},null,null,null,null,null,null,null,null,0,0]
[{"$f":"'Org structure'!E138","v":0},null,null,null,null,null,null,null,null,0,0]
[{"$f":"'Org structure'!E139","v":0},null,null,null,null,null,null,null,null,0,0]
[{"$f":"'Org structure'!E140","v":0},null,null,null,null,null,null,null,null,0,0]
[{"$f":"'Org structure'!E141","v":0},null,null,null,null,null,null,null,null,0,0]
[{"$f":"'Org structure'!E142","v":0},null,null,null,null,null,null,null,null,0,0]
[{"$f":"'Org structure'!E143","v":0},null,null,null,null,null,null,null,null,0,0]
[{"$f":"'Org structure'!E144","v":0},null,null,null,null,null,null,null,null,0,0]
[{"$f":"'Org structure'!A15","v":"Vote 14 - [NAME OF VOTE 14]"},null,{"$f":"SUM(C151:C160)","v":0},{"$f":"SUM(D151:D160)","v":0},0,0,0,0,0,0,0,{"$f":"SUM(L151:L160)","v":0},{"$f":"SUM(M151:M160)","v":0}]
[{"$f":"'Org structure'!E146","v":"14.1 - [Name of sub-vote]"},null,null,null,null,null,null,null,null,0,0]
[{"$f":"'Org structure'!E147","v":0},null,null,null,null,null,null,null,null,0,0]
[{"$f":"'Org structure'!E148","v":0},null,null,null,null,null,null,null,null,0,0]
[{"$f":"'Org structure'!E149","v":0},null,null,null,null,null,null,null,null,0,0]
[{"$f":"'Org structure'!E150","v":0},null,null,null,null,null,null,null,null,0,0]
[{"$f":"'Org structure'!E151","v":0},null,null,null,null,null,null,null,null,0,0]
[{"$f":"'Org structure'!E152","v":0},null,null,null,null,null,null,null,null,0,0]
[{"$f":"'Org structure'!E153","v":0},null,null,null,null,null,null,null,null,0,0]
[{"$f":"'Org structure'!E154","v":0},null,null,null,null,null,null,null,null,0,0]
[{"$f":"'Org structure'!E155","v":0},null,null,null,null,null,null,null,null,0,0]
[{"$f":"'Org structure'!A16","v":"Vote 15 - [NAME OF VOTE 15]"},null,{"$f":"SUM(C162:C171)","v":0},{"$f":"SUM(D162:D171)","v":0},0,0,0,0,0,0,0,{"$f":"SUM(L162:L171)","v":0},{"$f":"SUM(M162:M171)","v":0}]
[{"$f":"'Org structure'!E157","v":"15.1 - [Name of sub-vote]"},null,null,null,null,null,null,null,null,0,0]
[{"$f":"'Org structure'!E158","v":0},null,null,null,null,null,null,null,null,0,0]
[{"$f":"'Org structure'!E159","v":0},null,null,null,null,null,null,null,null,0,0]
[{"$f":"'Org structure'!E160","v":0},null,null,null,null,null,null,null,null,0,0]
[{"$f":"'Org structure'!E161","v":0},null,null,null,null,null,null,null,null,0,0]
[{"$f":"'Org structure'!E162","v":0},null,null,null,null,null,null,null,null,0,0]
[{"$f":"'Org structure'!E163","v":0},null,null,null,null,null,null,null,null,0,0]
[{"$f":"'Org structure'!E164","v":0},null,null,null,null,null,null,null,null,0,0]
[{"$f":"'Org structure'!E165","v":0},null,null,null,null,null,null,null,null,0,0]
[{"$f":"'Org structure'!E166","v":0},null,null,null,null,null,null,null,null,0,0]
["Total Revenue by Vote",2,{"$f":"C7+C18+C29+C40+C51+C62+C73+C84+C95+C106+C117+C128+C139+C150+C161","v":402707680.44000006},{"$f":"D7+D18+D29+D40+D51+D62+D73+D84+D95+D106+D117+D128+D139+D150+D161","v":0},0,0,0,0,46417201,{"$f":"SUM(E172:I172)","v":46417201},{"$f":"IF(D172=0,C172+J172,D172+J172)","v":449124881.44000006},{"$f":"L7+L18+L29+L40+L51+L62+L73+L84+L95+L106+L117+L128+L139+L150+L161","v":456237483},{"$f":"M7+M18+M29+M40+M51+M62+M73+M84+M95+M106+M117+M128+M139+M150+M161","v":491832071.5}]
[]
["Expenditure by Vote",1]
[{"$f":"A7","v":"Vote 1 - Executive & Council"},null,{"$f":"SUM(C176:C185)","v":47800391.169999994},0,0,0,0,0,4582730,{"$f":"SUM(E175:I175)","v":4582730},{"$f":"IF(D175=0,C175+J175,D175+J175)","v":52383121.169999994},{"$f":"SUM(L176:L185)","v":56492940},{"$f":"SUM(M176:M185)","v":60004430}]
[{"$f":"A8","v":"1,1 - Mayor and Council"},null,39561229.979999997,null,null,null,null,null,3700273,{"$f":"SUM(E176:I176)","v":3700273},{"$f":"IF(D176=0,C176+J176,D176+J176)","v":43261502.979999997},46774124,49653891]
["1,2 - Municipal Manager",null,8239161.1900000004,null,null,null,null,null,882457,882457,9121618.1900000013,9718816,10350539]
[0,null,null,null,null,null,null,null,null,0,0]
[0,null,null,null,null,null,null,null,null,0,0]
[0,null,null,null,null,null,null,null,null,0,0]
[0,null,null,null,null,null,null,null,null,0,0]
[0,null,null,null,null,null,null,null,null,0,0]
[0,null,null,null,null,null,null,null,null,0,0]
[0,null,null,null,null,null,null,null,null,0,0]
[0,null,null,null,null,null,null,null,null,0,0]
[{"$f":"A18","v":"Vote 2 - Finance and Administration"},null,{"$f":"SUM(C187:C196)","v":74406900.689999998},0,0,0,0,0,16494809,16494809,90901709.689999998,{"$f":"SUM(L187:L196)","v":97198856},{"$f":"SUM(M187:M196)","v":103377226}]
[{"$f":"A19","v":"2,1 - Administrative and Corporate Support"},null,20206768.219999999,null,null,null,null,null,972091,972091,21178859.219999999,22555485,24021591]
["2,2 - Asset Management",null,4087160.29,null,null,null,null,null,189245,189245,4276405.29,4554372,4850406]
["2,3 - Budget and Treasury Office",null,23968834.34,null,null,null,null,null,7797348,7797348,31766182.34,34223934,36308935]
["2,4 - Human Resource",null,6977174.9299999997,null,null,null,null,null,1085368,1085368,8062542.9299999997,8586605,9144735]
["2,5 - Information Technology",null,6403449.8200000003,null,null,null,null,null,-964705,-964705,5438744.8200000003,5787970,6164188]
["2,6 - Legal Services",null,4346185.0999999996,null,null,null,null,null,2744083,2744083,7090268.0999999996,7551135,8041959]
["2,7 - Customer Relation and Coordination",null,2151894.46,null,null,null,null,null,0,0,2151894.46,2291767,2440732]
["2,8 - Property Services",null,3136452,null,null,null,null,null,4463160,4463160,7599612,8093587,8619670]
["2,9 - Risk Management",null,847756.79,null,null,null,null,null,17107,17107,864863.79,921080,980950]
["2.10 - Supply Chain Management",null,2281224.7400000002,null,null,null,null,null,191112,191112,2472336.7400000002,2632921,2804060]
["Vote 3 - Internal Audit",null,{"$f":"SUM(C198:C207)","v":1938939.02},0,0,0,0,0,528014,528014,2466953.02,{"$f":"SUM(L198:L207)","v":2627305},{"$f":"SUM(M198:M207)","v":2798080}]
["3,1 - Governance Function",null,1938939.02,null,null,null,null,null,528014,528014,2466953.02,2627305,2798080]
[0,null,null,null,null,null,null,null,null,0,0]
[0,null,null,null,null,null,null,null,null,0,0]
[0,null,null,null,null,null,null,null,null,0,0]
[0,null,null,null,null,null,null,null,null,0,0]
[0,null,null,null,null,null,null,null,null,0,0]
[0,null,null,null,null,null,null,null,null,0,0]
[0,null,null,null,null,null,null,null,null,0,0]
[0,null,null,null,null,null,null,null,null,0,0]
[0,null,null,null,null,null,null,null,null,0,0]
["Vote 4 - Community and Public Safety",null,{"$f":"SUM(C209:C218)","v":4334295.18},0,0,0,0,0,681923,681923,5016218.18,{"$f":"SUM(L209:L218)","v":5342273},{"$f":"SUM(M209:M218)","v":5689520}]
["4,1 - Cemetries and crematoriums",null,257880.39,null,null,null,null,null,-1318,-1318,256562.39,273239,290999]
["4,2 - Community halls and Facilities",null,1484481.45,null,null,null,null,null,18320,18320,1502801.45,1600484,1704516]
["4,3 - Disaster Management",null,1038276.39,null,null,null,null,null,109241,109241,1147517.3900000001,1222106,1301542]
["4,4 - Libraries and Archives",null,1553656.95,null,null,null,null,null,555680,555680,2109336.9500000002,2246444,2392463]
[0,null,null,null,null,null,null,null,null,0,0]
[0,null,null,null,null,null,null,null,null,0,0]
[0,null,null,null,null,null,null,null,null,0,0]
[0,null,null,null,null,null,null,null,null,0,0]
[0,null,null,null,null,null,null,null,null,0,0]
[0,null,null,null,null,null,null,null,null,0,0]
[{"$f":"A51","v":"Vote 5 - Sports and Recreation"},null,{"$f":"SUM(C220:C229)","v":7690965.4299999997},0,0,0,0,0,4638963,4638963,12329928.43,{"$f":"SUM(L220:L229)","v":13131373},{"$f":"SUM(M220:M229)","v":13984913}]
[{"$f":"A52","v":"5,1 - Community parks"},null,7690965.4299999997,null,null,null,null,null,4638963,4638963,12329928.43,13131373,13984913]
[0,null,null,null,null,null,null,null,null,0,0]
[0,null,null,null,null,null,null,null,null,0,0]
[0,null,null,null,null,null,null,null,null,0,0]
[0,null,null,null,null,null,null,null,null,0,0]
[0,null,null,null,null,null,null,null,null,0,0]
[0,null,null,null,null,null,null,null,null,0,0]
[0,null,null,null,null,null,null,null,null,0,0]
[0,null,null,null,null,null,null,null,null,0,0]
[0,null,null,null,null,null,null,null,null,0,0]
[{"$f":"A62","v":"Vote 6 - Housing"},null,{"$f":"SUM(C231:C240)","v":727499.11},0,0,0,0,0,0,0,727499.11,{"$f":"SUM(L231:L240)","v":774786},{"$f":"SUM(M231:M240)","v":825147}]
[{"$f":"A63","v":"6,1 - Housing"},null,727499.11,null,null,null,null,null,null,0,727499.11,774786,825147]
[0,null,null,null,null,null,null,null,null,0,0]
[0,null,null,null,null,null,null,null,null,0,0]
[0,null,null,null,null,null,null,null,null,0,0]
[0,null,null,null,null,null,null,null,null,0,0]
[0,null,null,null,null,null,null,null,null,0,0]
[0,null,null,null,null,null,null,null,null,0,0]
[0,null,null,null,null,null,null,null,null,0,0]
[0,null,null,null,null,null,null,null,null,0,0]
[0,null,null,null,null,null,null,null,null,{"$f":"SUM(E240:I240)","v":0},{"$f":"IF(D240=0,C240+J240,D240+J240)","v":0}]
[{"$f":"A73","v":"Vote 7 - Planning and development "},null,{"$f":"SUM(C242:C251)","v":13504109.48},0,0,0,0,0,-1917559,-1917559,11586550.48,{"$f":"SUM(L242:L251)","v":12339676},{"$f":"SUM(M242:M251)","v":13141754}]
[{"$f":"A74","v":"7,1 - Corporate Wide Strategic Planning (IDP & LED)"},null,8839649.2400000002,null,null,null,null,null,-3218341,-3218341,5621308.2400000002,4996383,5321147]
["7,2 - Town Planning and Building Regulations",null,2141460.2400000002,null,null,null,null,null,1034885,1034885,3176345.24,4373118,4657371]
["7,3 - Project Management Unit",null,2523000,null,null,null,null,null,265897,265897,2788897,2970175,3163236]
[0,null,null,null,null,null,null,null,null,0,0]
[0,null,null,null,null,null,null,null,null,0,0]
[0,null,null,null,null,null,null,null,null,0,0]
[0,null,null,null,null,null,null,null,null,0,0]
[0,null,null,null,null,null,null,null,null,0,0]
[0,null,null,null,null,null,null,null,null,0,0]
[0,null,null,null,null,null,null,null,null,0,0]
[{"$f":"A84","v":"Vote 8 - Road Transport"},null,{"$f":"SUM(C253:C262)","v":34877675.260000005},0,0,0,0,0,18953704,18953704,53831379.260000005,{"$f":"SUM(L253:L262)","v":44715946},{"$f":"SUM(M253:M262)","v":47576997}]
[{"$f":"A85","v":"8,1 - Road and Traffic Regulations"},null,15612924.710000001,null,null,null,null,null,10123788,10123788,25736712.710000001,27409599,29191223]
["8,2 - Roads",null,19031539.850000001,null,null,null,null,null,8590631,8590631,27622170.850000001,16803139,17849857]
["8,3 - Taxi Ranks",null,233210.7,null,null,null,null,null,239285,239285,472495.7,503208,535917]
[0,null,null,null,null,null,null,null,null,0,0]
[0,null,null,null,null,null,null,null,null,0,0]
[0,null,null,null,null,null,null,null,null,0,0]
[0,null,null,null,null,null,null,null,null,0,0]
[0,null,null,null,null,null,null,null,null,0,0]
[0,null,null,null,null,null,null,null,null,0,0]
[0,null,null,null,null,null,null,null,null,0,0]
["Vote 9 - Energy Sources",null,{"$f":"SUM(C264:C273)","v":32487354.719999999},0,0,0,0,0,7962807,7962807,40450161.719999999,{"$f":"SUM(L264:L273)","v":43079420},{"$f":"SUM(M264:M273)","v":45879583}]
["9,1 - Electricity",null,24676142.140000001,null,null,null,null,null,9762331,9762331,34438473.140000001,36676973,39060977]
["9,2 - Street Lighting",null,7811212.5800000001,null,null,null,null,null,-1799524,-1799524,6011688.5800000001,6402447,6818606]
[0,null,null,null,null,null,null,null,null,0,0]
[0,null,null,null,null,null,null,null,null,0,0]
[0,null,null,null,null,null,null,null,null,0,0]
[0,null,null,null,null,null,null,null,null,0,0]
[0,null,null,null,null,null,null,null,null,0,0]
[0,null,null,null,null,null,null,null,null,0,0]
[0,null,null,null,null,null,null,null,null,0,0]
[0,null,null,null,null,null,null,null,null,0,0]
[{"$f":"A106","v":"Vote 10 - Waste Water Management"},null,{"$f":"SUM(C275:C284)","v":686133},0,0,0,0,0,14324,14324,700457,{"$f":"SUM(L275:L284)","v":745986},{"$f":"SUM(M275:M284)","v":794475}]
[{"$f":"A107","v":"10,1 - Public Toilets"},null,686133,null,null,null,null,null,14324,14324,700457,745986,794475]
[{"$f":"A108","v":0},null,null,null,null,null,null,null,null,0,0]
[0,null,null,null,null,null,null,null,null,0,0]
[0,null,null,null,null,null,null,null,null,0,0]
[0,null,null,null,null,null,null,null,null,0,0]
[0,null,null,null,null,null,null,null,null,0,0]
[0,null,null,null,null,null,null,null,null,0,0]
[0,null,null,null,null,null,null,null,null,0,0]
[0,null,null,null,null,null,null,null,null,0,0]
[{"$f":"A116","v":0},null,null,null,null,null,null,null,null,0,0]
[{"$f":"A117","v":"Vote 11 - Waste Management"},null,{"$f":"SUM(C286:C295)","v":4976098.47},0,0,0,0,0,93505,93505,5069603.47,{"$f":"SUM(L286:L295)","v":5399128},{"$f":"SUM(M286:M295)","v":5750071}]
[{"$f":"A118","v":"11,1 - Solid Waste Removal"},null,4976098.47,null,null,null,null,null,93505,93505,5069603.47,5399128,5750071]
[{"$f":"A119","v":0},null,null,null,null,null,null,null,null,0,0]
[0,null,null,null,null,null,null,null,null,0,0]
[0,null,null,null,null,null,null,null,null,0,0]
[0,null,null,null,null,null,null,null,null,0,0]
[0,null,null,null,null,null,null,null,null,0,0]
[0,null,null,null,null,null,null,null,null,0,0]
[0,null,null,null,null,null,null,null,null,0,0]
[0,null,null,null,null,null,null,null,null,0,0]
[0,null,null,null,null,null,null,null,null,0,0]
["Vote 12 - [NAME OF VOTE 12]",null,{"$f":"SUM(C297:C306)","v":0},0,0,0,0,0,0,0,0,{"$f":"SUM(L297:L306)","v":0},{"$f":"SUM(M297:M306)","v":0}]
["12.1 - [Name of sub-vote]",null,null,null,null,null,null,null,null,0,0]
[0,null,null,null,null,null,null,null,null,0,0]
[0,null,null,null,null,null,null,null,null,0,0]
[0,null,null,null,null,null,null,null,null,0,0]
[0,null,null,null,null,null,null,null,null,0,0]
[0,null,null,null,null,null,null,null,null,0,0]
[0,null,null,null,null,null,null,null,null,0,0]
[0,null,null,null,null,null,null,null,null,{"$f":"SUM(E304:I304)","v":0},{"$f":"IF(D304=0,C304+J304,D304+J304)","v":0}]
[0,null,null,null,null,null,null,null,null,0,0]
[0,null,null,null,null,null,null,null,null,0,0]
["Vote 13 - [NAME OF VOTE 13]",null,{"$f":"SUM(C308:C317)","v":0},0,0,0,0,0,0,0,0,{"$f":"SUM(L308:L317)","v":0},{"$f":"SUM(M308:M317)","v":0}]
["13.1 - [Name of sub-vote]",null,null,null,null,null,null,null,null,0,0]
[0,null,null,null,null,null,null,null,null,0,0]
[0,null,null,null,null,null,null,null,null,0,0]
[0,null,null,null,null,null,null,null,null,0,0]
[0,null,null,null,null,null,null,null,null,0,0]
[0,null,null,null,null,null,null,null,null,0,0]
[0,null,null,null,null,null,null,null,null,0,0]
[0,null,null,null,null,null,null,null,null,0,0]
[0,null,null,null,null,null,null,null,null,0,0]
[0,null,null,null,null,null,null,null,null,0,0]
["Vote 14 - [NAME OF VOTE 14]",null,{"$f":"SUM(C319:C328)","v":0},0,0,0,0,0,0,0,0,{"$f":"SUM(L319:L328)","v":0},{"$f":"SUM(M319:M328)","v":0}]
["14.1 - [Name of sub-vote]",null,null,null,null,null,null,null,null,0,0]
[0,null,null,null,null,null,null,null,null,0,0]
[0,null,null,null,null,null,null,null,null,0,0]
[0,null,null,null,null,null,null,null,null,0,0]
[0,null,null,null,null,null,null,null,null,0,0]
[0,null,null,null,null,null,null,null,null,0,0]
[0,null,null,null,null,null,null,null,null,0,0]
[0,null,null,null,null,null,null,null,null,0,0]
[0,null,null,null,null,null,null,null,null,0,0]
[0,null,null,null,null,null,null,null,null,0,0]
["Vote 15 - [NAME OF VOTE 15]",null,{"$f":"SUM(C330:C339)","v":0},0,0,0,0,0,0,0,0,{"$f":"SUM(L330:L339)","v":0},{"$f":"SUM(M330:M339)","v":0}]
["15.1 - [Name of sub-vote]",null,null,null,null,null,null,null,null,0,0]
[0,null,null,null,null,null,null,null,null,0,0]
[0,null,null,null,null,null,null,null,null,0,0]
[0,null,null,null,null,null,null,null,null,0,0]
[0,null,null,null,null,null,null,null,null,0,0]
[0,null,null,null,null,null,null,null,null,0,0]
[0,null,null,null,null,null,null,null,null,0,0]
[0,null,null,null,null,null,null,null,null,0,0]
[0,null,null,null,null,null,null,null,null,0,0]
[0,null,null,null,null,null,null,null,null,0,0]
["Total Expenditure by Vote",2,{"$f":"C175+C186+C197+C208+C219+C230+C241+C252+C263+C285+C296+C307+C318+C329+C274","v":223430361.52999997},{"$f":"D175+D186+D197+D208+D219+D230+D241+D252+D263+D285+D296+D307+D318+D329+D274","v":0},0,0,0,0,52033220,{"$f":"SUM(E340:I340)","v":52033220},{"$f":"IF(D340=0,C340+J340,D340+J340)","v":275463581.52999997},{"$f":"L175+L186+L197+L208+L219+L230+L241+L252+L263+L285+L296+L307+L318+L329+L274","v":281847689},{"$f":"M175+M186+M197+M208+M219+M230+M241+M252+M263+M285+M296+M307+M318+M329+M274","v":299822196}]
[]
[{"$f":"result","v":"Surplus/ (Deficit) for the year"},2,{"$f":"C172-C340","v":179277318.91000009},0,0,0,0,0,-5616019,{"$f":"SUM(E342:I342)","v":-5616019},{"$f":"IF(D342=0,C342+J342,D342+J342)","v":173661299.91000009},{"$f":"L172-L340","v":174389794},{"$f":"M172-M340","v":192009875.5}]
[{"$f":"head27a","v":"References"}]
["1. Insert 'Vote'; e.g. Department, if different to standard structure"]
["2. Must reconcile to Financial Performance ('Revenue and Expenditure by Standard Classification' and 'Revenue and Expenditure')"]
["3. Assign share in 'associate' to relevant Vote"]

{"sheet":"B4-FinPerf RE","index":11,"n_rows":62,"n_cols":13,"rows_kept":62,"cut":false,"hidden":false,"merged":[[1,2,1,10],[1,1,3,1],[59,0,59,12],[60,0,60,12],[52,0,52,12],[53,0,53,12],[54,0,54,12],[55,0,55,12],[57,0,57,12],[1,0,3,0]]}
[{"$f":"muni&\" - \"&_ADJ4&\" - \"&Date","v":"LIM332 Greater Letaba - Table B4 Adjustments Budget Financial Performance (revenue and expenditure) - 27 February 2019"}]
[{"$f":"desc","v":"Description"},{"$f":"head27","v":"Ref"},{"$f":"Head2","v":"Budget Year 2018/19"},null,null,null,null,null,null,null,null,{"$f":"Head10","v":"Budget Year +1 2019/20"},{"$f":"Head11","v":"Budget Year +2 2020/21"}]
[null,null,{"$f":"Head6","v":"Original Budget"},{"$f":"Head54","v":"Prior Adjusted"},{"$f":"Head51","v":"Accum. Funds"},{"$f":"Head52","v":"Multi-year capital"},{"$f":"Head53","v":"Unfore. Unavoid."},{"$f":"Head55","v":"Nat. or Prov. Govt"},{"$f":"Head50","v":"Other Adjusts."},{"$f":"Head56","v":"Total Adjusts."},{"$f":"Head7","v":"Adjusted Budget"},{"$f":"Head7","v":"Adjusted Budget"},{"$f":"Head7","v":"Adjusted Budget"}]
[null,null,null,3,4,5,6,7,8,9,10]
["R thousands",1,"A","A1","B","C","D","E","F","G","H"]
["Revenue By Source"]
["Property rates",2,{"$f":"'SB1'!C10","v":12255327.57},{"$f":"'SB1'!D10","v":0},{"$f":"'SB1'!E10","v":0},{"$f":"'SB1'!F10","v":0},{"$f":"'SB1'!G10","v":0},{"$f":"'SB1'!H10","v":0},{"$f":"'SB1'!I10","v":4607959},{"$f":"SUM(E7:I7)","v":4607959},{"$f":"IF(D7=0,C7+J7,D7+J7)","v":16863286.57},{"$f":"'SB1'!L10","v":16894401},{"$f":"'SB1'!M10","v":17992537}]
["Service charges - electricity revenue",2,{"$f":"'SB1'!C16","v":12658643.210000001},{"$f":"'SB1'!D16","v":0},{"$f":"'SB1'!E16","v":0},{"$f":"'SB1'!F16","v":0},{"$f":"'SB1'!G16","v":0},{"$f":"'SB1'!H16","v":0},{"$f":"'SB1'!I16","v":11808000},11808000,24466643.210000001,{"$f":"'SB1'!L16","v":23926975},{"$f":"'SB1'!M16","v":25482229}]
["Service charges - water revenue",2,{"$f":"'SB1'!C22","v":0},{"$f":"'SB1'!D22","v":0},{"$f":"'SB1'!E22","v":0},{"$f":"'SB1'!F22","v":0},{"$f":"'SB1'!G22","v":0},{"$f":"'SB1'!H22","v":0},{"$f":"'SB1'!I22","v":0},0,0,{"$f":"'SB1'!L22","v":0},{"$f":"'SB1'!M22","v":0}]
["Service charges - sanitation revenue",2,{"$f":"'SB1'!C28","v":0},{"$f":"'SB1'!D28","v":0},{"$f":"'SB1'!E28","v":0},{"$f":"'SB1'!F28","v":0},{"$f":"'SB1'!G28","v":0},{"$f":"'SB1'!H28","v":0},{"$f":"'SB1'!I28","v":0},0,0,{"$f":"'SB1'!L28","v":0},{"$f":"'SB1'!M28","v":0}]
["Service charges - refuse revenue",2,{"$f":"'SB1'!C35","v":6243396.8199999994},{"$f":"'SB1'!D35","v":0},{"$f":"'SB1'!E35","v":0},{"$f":"'SB1'!F35","v":0},{"$f":"'SB1'!G35","v":0},{"$f":"'SB1'!H35","v":0},{"$f":"'SB1'!I35","v":2000000},2000000,8243396.8199999994,{"$f":"'SB1'!L35","v":7714218},{"$f":"'SB1'!M35","v":8215642}]
["Service charges - other",null,0,null,null,null,null,null,0,0,0,0,0]
["Rental of facilities and equipment",null,956797.77,null,null,null,null,null,0,0,956797.77,1018989,1085223]
["Interest earned - external investments",null,4519515.4400000004,null,null,null,null,null,0,0,4519515.4400000004,4813283,5126147]
["Interest earned - outstanding debtors",null,8441397.7699999996,null,null,null,null,null,{"$f":"8786255+2000000","v":10786255},10786255,19227652.77,18347450,19540035]
["Dividends received",null,0,null,null,null,null,null,0,0,0,0,0]
["Fines, penalties and forfeits",null,1200000,null,null,null,null,null,0,0,1200000,1278000,1361070]
["Licences and permits",null,8085004.6399999997,null,null,null,null,null,14600000,14600000,22685004.640000001,24159530,25729899]
["Agency services",null,2176014.33,null,null,null,null,null,0,0,2176014.33,2317455,2468089]
["Transfers and subsidies",null,248358000,null,null,null,null,null,0,0,248358000,274109000,297262000]
["Other revenue",2,{"$f":"'SB1'!C50","v":34785582.68},{"$f":"'SB1'!D50","v":0},{"$f":"'SB1'!E50","v":0},{"$f":"'SB1'!F50","v":0},{"$f":"'SB1'!G50","v":0},{"$f":"'SB1'!H50","v":0},{"$f":"'SB1'!I50","v":2622986},2622986,37408568.68,{"$f":"'SB1'!L50","v":12799775},{"$f":"'SB1'!M50","v":13631760}]
["Gains on disposal of PPE",null,577000,null,null,null,null,null,0,0,577000,614505,654447]
["Total Revenue (excluding capital transfers and contributions)",null,{"$f":"SUM(C7:C22)","v":340256680.23000002},0,0,0,0,0,46425200,46425200,386681880.23000002,387993581,418549078]
[]
["Expenditure By Type"]
["Employee related costs",null,{"$f":"'SB1'!C68","v":78303797.25},{"$f":"'SB1'!D68","v":0},{"$f":"'SB1'!E68","v":0},{"$f":"'SB1'!F68","v":0},{"$f":"'SB1'!G68","v":0},{"$f":"'SB1'!H68","v":0},{"$f":"'SB1'!I68","v":16962495},{"$f":"SUM(E26:I26)","v":16962495},{"$f":"IF(D26=0,C26+J26,D26+J26)","v":95266292.25},{"$f":"'SB1'!L68","v":101544882},{"$f":"'SB1'!M68","v":108008806}]
["Remuneration of councillors",null,22467855,0,0,0,0,0,414177,414177,22882032,24369368,25953376]
["Debt impairment",null,1956620.19,0,0,0,0,0,0,0,1956620.19,2083801,2219248]
["Depreciation & asset impairment",null,{"$f":"'SB1'!C84","v":5043379.8099999996},{"$f":"'SB1'!D84","v":0},{"$f":"'SB1'!E84","v":0},{"$f":"'SB1'!F84","v":0},{"$f":"'SB1'!G84","v":0},{"$f":"'SB1'!H84","v":0},{"$f":"'SB1'!I84","v":898831},898831,5942210.8099999996,{"$f":"'SB1'!L84","v":6865248},{"$f":"'SB1'!M84","v":7311489}]
["Finance charges",null,0,0,0,0,0,0,0,0,0,0,0]
["Bulk purchases",null,{"$f":"'SB1'!C89","v":17096559},{"$f":"'SB1'!D89","v":0},{"$f":"'SB1'!E89","v":0},{"$f":"'SB1'!F89","v":0},{"$f":"'SB1'!G89","v":0},{"$f":"'SB1'!H89","v":0},{"$f":"'SB1'!I89","v":0},0,17096559,{"$f":"'SB1'!L89","v":18207835},{"$f":"'SB1'!M89","v":19391344}]
["Other materials",null,0,0,0,0,0,0,0,0,0,0,0]
["Contracted services",null,{"$f":"'SB1'!C128","v":15119136.5024},{"$f":"'SB1'!D128","v":0},{"$f":"'SB1'!E128","v":0},{"$f":"'SB1'!F128","v":0},{"$f":"'SB1'!G128","v":0},{"$f":"'SB1'!H128","v":0},{"$f":"'SB1'!I128","v":4257029},4257029,19376165.5024,{"$f":"'SB1'!L128","v":20635616},{"$f":"'SB1'!M128","v":21976931}]
["Transfers and subsidies",null,0,0,0,0,0,0,0,0,0,0,0]
["Other expenditure",null,{"$f":"'SB1'!C158","v":83443013.609999999},{"$f":"'SB1'!D158","v":0},{"$f":"'SB1'!E158","v":0},{"$f":"'SB1'!F158","v":0},{"$f":"'SB1'!G158","v":0},{"$f":"'SB1'!H158","v":0},{"$f":"'SB1'!I158","v":29499923.699999999},29499923.699999999,112942937.31,{"$f":"'SB1'!L158","v":108140816.27764998},{"$f":"'SB1'!M158","v":114960532.39565724}]
["Loss on disposal of PPE",null,0,0,0,0,0,0,0,0,0,0,0]
["Total Expenditure",null,{"$f":"SUM(C26:C36)","v":223430361.3624},0,0,0,0,0,52032455.700000003,52032455.700000003,275462817.06239998,281847566.27765,299821726.39565724]
[]
["Surplus/(Deficit)",null,{"$f":"C23-C37","v":116826318.86760002},0,0,0,0,0,-5607255.700000003,-5607255.700000003,111219063.16760004,106146014.72235,118727351.60434276]
["Transfers and subsidies - capital (monetary allocations) (National / Provincial and District)",null,{"$f":"56460000+5983000","v":62443000},0,0,0,0,null,0,{"$f":"SUM(E40:I40)","v":0},{"$f":"IF(D40=0,C40+J40,D40+J40)","v":62443000},{"$f":"57608000+10635000","v":68243000},{"$f":"60783000+12500000","v":73283000}]
["Transfers and subsidies - capital (monetary allocations) (National / Provincial Departmental Agencies, Households, Non-profit Institutions, Private Enterprises, Public Corporatons, Higher Educational Institutions)",null,0,0,0,0,0,0,0,{"$f":"SUM(E41:I41)","v":0},{"$f":"IF(D41=0,C41+J41,D41+J41)","v":0},0,0]
["Transfers and subsidies - capital (in-kind - all) ",null,0,0,0,0,0,0,0,{"$f":"SUM(E42:I42)","v":0},{"$f":"IF(D42=0,C42+J42,D42+J42)","v":0},0,0]
["Surplus/(Deficit) before taxation",null,{"$f":"SUM(C39:C42)","v":179269318.86760002},0,0,0,0,0,-5607255.700000003,-5607255.700000003,173662063.16760004,174389014.72235,192010351.60434276]
["Taxation",null,0,0,0,0,0,0,0,{"$f":"SUM(E44:I44)","v":0},{"$f":"IF(D44=0,C44+J44,D44+J44)","v":0},0,0]
["Surplus/(Deficit) after taxation",null,{"$f":"C43-C44","v":179269318.86760002},0,0,0,0,0,-5607255.700000003,-5607255.700000003,173662063.16760004,174389014.72235,192010351.60434276]
["Attributable to minorities",null,0,0,0,0,0,0,0,{"$f":"SUM(E46:I46)","v":0},{"$f":"IF(D46=0,C46+J46,D46+J46)","v":0},0,0]
["Surplus/(Deficit) attributable to municipality",null,{"$f":"SUM(C45:C46)","v":179269318.86760002},0,0,0,0,0,-5607255.700000003,-5607255.700000003,173662063.16760004,174389014.72235,192010351.60434276]
["Share of surplus/ (deficit) of associate",null,0,0,0,0,0,0,0,{"$f":"SUM(E48:I48)","v":0},{"$f":"IF(D48=0,C48+J48,D48+J48)","v":0},0,0]
["Surplus/ (Deficit) for the year",null,{"$f":"C47+C48","v":179269318.86760002},0,0,0,0,0,-5607255.700000003,-5607255.700000003,173662063.16760004,174389014.72235,192010351.60434276]
[{"$f":"head27a","v":"References"}]
["1. Classifications are revenue sources and expenditure type"]
["2. Detail to be provided in Table SB1"]
["3. Only complete if a previous adjusted budget has been approved in the same financial year. Reflect most recent adjusted budget."]
["4. Additional cash-backed accumulated funds/unspent funds (MFMA section 18(1)(b) and section 28(2)(e)) identified after the Original Budget approved and after annual financial statements audited (note: only where underspending could not reasonably have been foreseen)"]
["5. Increases of funds approved under MFMA section 31"]
["6. Adjustments approved in accordance with MFMA section 29 "]
["7. Adjustments to transfers from National or Provincial Government"]
["8. Adjusts. = 'Other' Adjustments proposed to be approved; including revenue under-collection (MFMA section 28(2)(a)); additional revenue appropriation on existing programmes (section 28(2))(b); projected savings (section 28(2)(d)); error correction (section 28(2)(f))"]
["9. G = B + C + D + E + F"]
["10. Adjusted Budget H = (A or A1/2 etc) + G"]
[]
["Revenue total",null,{"$f":"C23+C40+C41+C42","v":402699680.23000002},0,0,0,0,0,46425200,46425200,449124880.23000002,456236581,491832078]

{"sheet":"B5-Capex","index":12,"n_rows":91,"n_cols":13,"rows_kept":91,"cut":false,"hidden":false,"merged":[[88,0,88,12],[1,0,2,0],[1,1,2,1],[78,0,78,12],[1,2,1,10],[79,0,79,11],[80,0,80,11],[81,0,81,12],[82,0,82,12],[83,0,83,12],[84,0,84,12],[86,0,86,12]]}
[{"$f":"muni&\" - \"&_ADJ5&\" - \"&Date","v":"LIM332 Greater Letaba - Table B5 Adjustments Capital Expenditure Budget by vote and funding - 27 February 2019"}]
[{"$f":"desc","v":"Description"},{"$f":"head27","v":"Ref"},{"$f":"Head2","v":"Budget Year 2018/19"},null,null,null,null,null,null,null,null,{"$f":"Head10","v":"Budget Year +1 2019/20"},{"$f":"Head11","v":"Budget Year +2 2020/21"}]
[null,null,{"$f":"Head6","v":"Original Budget"},{"$f":"Head54","v":"Prior Adjusted"},{"$f":"Head51","v":"Accum. Funds"},{"$f":"Head52","v":"Multi-year capital"},{"$f":"Head53","v":"Unfore. Unavoid."},{"$f":"Head55","v":"Nat. or Prov. Govt"},{"$f":"Head50","v":"Other Adjusts."},{"$f":"Head56","v":"Total Adjusts."},{"$f":"Head7","v":"Adjusted Budget"},{"$f":"Head7","v":"Adjusted Budget"},{"$f":"Head7","v":"Adjusted Budget"}]
[null,null,null,5,6,7,8,9,10,11,12]
["R thousands",null,"A","A1","B","C","D","E","F","G","H"]
["Capital expenditure - Vote"]
["Multi-year expenditure to be adjusted",2]
[{"$f":"B5B!A8","v":"Vote 1 - Executive & Council"},null,{"$f":"B5B!C8","v":0},{"$f":"B5B!D8","v":0},{"$f":"B5B!E8","v":0},{"$f":"B5B!F8","v":0},{"$f":"B5B!G8","v":0},{"$f":"B5B!H8","v":0},{"$f":"B5B!I8","v":0},{"$f":"SUM(E8:I8)","v":0},{"$f":"IF(D8=0,C8+J8,D8+J8)","v":0},{"$f":"B5B!L8","v":0},{"$f":"B5B!M8","v":0}]
[{"$f":"B5B!A19","v":"Vote 2 - Finance and Administration"},null,{"$f":"B5B!C19","v":0},{"$f":"B5B!D19","v":0},{"$f":"B5B!E19","v":0},{"$f":"B5B!F19","v":0},{"$f":"B5B!G19","v":0},{"$f":"B5B!H19","v":0},{"$f":"B5B!I19","v":0},{"$f":"SUM(E9:I9)","v":0},0,{"$f":"B5B!L19","v":0},{"$f":"B5B!M19","v":0}]
[{"$f":"B5B!A30","v":"Vote 3 - Internal Audit"},null,{"$f":"B5B!C30","v":0},{"$f":"B5B!D30","v":0},{"$f":"B5B!E30","v":0},{"$f":"B5B!F30","v":0},{"$f":"B5B!G30","v":0},{"$f":"B5B!H30","v":0},{"$f":"B5B!I30","v":0},0,0,{"$f":"B5B!L30","v":0},{"$f":"B5B!M30","v":0}]
[{"$f":"B5B!A41","v":"Vote 4 - Community and Public Safety"},null,{"$f":"B5B!C41","v":3218446},{"$f":"B5B!D41","v":0},{"$f":"B5B!E41","v":0},{"$f":"B5B!F41","v":0},{"$f":"B5B!G41","v":0},{"$f":"B5B!H41","v":0},{"$f":"B5B!I41","v":-1500000},-1500000,1718446,{"$f":"B5B!L41","v":3200000},{"$f":"B5B!M41","v":7500000}]
[{"$f":"B5B!A52","v":"Vote 5 - Sports and Recreation"},null,{"$f":"B5B!C52","v":63505497},{"$f":"B5B!D52","v":0},{"$f":"B5B!E52","v":0},{"$f":"B5B!F52","v":0},{"$f":"B5B!G52","v":0},{"$f":"B5B!H52","v":0},{"$f":"B5B!I52","v":3165815},3165815,66671312,{"$f":"B5B!L52","v":59635415},{"$f":"B5B!M52","v":40832889}]
[{"$f":"B5B!A63","v":"Vote 6 - Housing"},null,{"$f":"B5B!C63","v":0},{"$f":"B5B!D63","v":0},{"$f":"B5B!E63","v":0},{"$f":"B5B!F63","v":0},{"$f":"B5B!G63","v":0},{"$f":"B5B!H63","v":0},{"$f":"B5B!I63","v":0},0,0,{"$f":"B5B!L63","v":0},{"$f":"B5B!M63","v":0}]
[{"$f":"B5B!A74","v":"Vote 7 - Planning and development "},null,{"$f":"B5B!C74","v":0},{"$f":"B5B!D74","v":0},{"$f":"B5B!E74","v":0},{"$f":"B5B!F74","v":0},{"$f":"B5B!G74","v":0},{"$f":"B5B!H74","v":0},{"$f":"B5B!I74","v":0},0,0,{"$f":"B5B!L74","v":0},{"$f":"B5B!M74","v":0}]
[{"$f":"B5B!A85","v":"Vote 8 - Road Transport"},null,{"$f":"B5B!C85","v":57269303.810000002},{"$f":"B5B!D85","v":0},{"$f":"B5B!E85","v":0},{"$f":"B5B!F85","v":0},{"$f":"B5B!G85","v":0},{"$f":"B5B!H85","v":0},{"$f":"B5B!I85","v":-16412343},-16412343,40856960.810000002,{"$f":"B5B!L85","v":50559811},{"$f":"B5B!M85","v":88870950}]
[{"$f":"B5B!A96","v":"Vote 9 - Energy Sources"},null,{"$f":"B5B!C96","v":0},{"$f":"B5B!D96","v":0},{"$f":"B5B!E96","v":0},{"$f":"B5B!F96","v":0},{"$f":"B5B!G96","v":0},{"$f":"B5B!H96","v":0},{"$f":"B5B!I96","v":0},0,0,{"$f":"B5B!L96","v":0},{"$f":"B5B!M96","v":0}]
[{"$f":"B5B!A107","v":"Vote 10 - Waste Water Management"},null,{"$f":"B5B!C107","v":0},{"$f":"B5B!D107","v":0},{"$f":"B5B!E107","v":0},{"$f":"B5B!F107","v":0},{"$f":"B5B!G107","v":0},{"$f":"B5B!H107","v":0},{"$f":"B5B!I107","v":0},0,0,{"$f":"B5B!L107","v":0},{"$f":"B5B!M107","v":0}]
[{"$f":"B5B!A118","v":"Vote 11 - Waste Management"},null,{"$f":"B5B!C118","v":0},{"$f":"B5B!D118","v":0},{"$f":"B5B!E118","v":0},{"$f":"B5B!F118","v":0},{"$f":"B5B!G118","v":0},{"$f":"B5B!H118","v":0},{"$f":"B5B!I118","v":0},0,0,{"$f":"B5B!L118","v":0},{"$f":"B5B!M118","v":0}]
[{"$f":"B5B!A129","v":"Vote 12 - [NAME OF VOTE 12]"},null,{"$f":"B5B!C129","v":0},{"$f":"B5B!D129","v":0},{"$f":"B5B!E129","v":0},{"$f":"B5B!F129","v":0},{"$f":"B5B!G129","v":0},{"$f":"B5B!H129","v":0},{"$f":"B5B!I129","v":0},0,0,{"$f":"B5B!L129","v":0},{"$f":"B5B!M129","v":0}]
[{"$f":"B5B!A140","v":"Vote 13 - [NAME OF VOTE 13]"},null,{"$f":"B5B!C140","v":0},{"$f":"B5B!D140","v":0},{"$f":"B5B!E140","v":0},{"$f":"B5B!F140","v":0},{"$f":"B5B!G140","v":0},{"$f":"B5B!H140","v":0},{"$f":"B5B!I140","v":0},0,0,{"$f":"B5B!L140","v":0},{"$f":"B5B!M140","v":0}]
[{"$f":"B5B!A151","v":"Vote 14 - [NAME OF VOTE 14]"},null,{"$f":"B5B!C151","v":0},{"$f":"B5B!D151","v":0},{"$f":"B5B!E151","v":0},{"$f":"B5B!F151","v":0},{"$f":"B5B!G151","v":0},{"$f":"B5B!H151","v":0},{"$f":"B5B!I151","v":0},0,0,{"$f":"B5B!L151","v":0},{"$f":"B5B!M151","v":0}]
[{"$f":"B5B!A162","v":"Vote 15 - [NAME OF VOTE 15]"},null,{"$f":"B5B!C162","v":0},{"$f":"B5B!D162","v":0},{"$f":"B5B!E162","v":0},{"$f":"B5B!F162","v":0},{"$f":"B5B!G162","v":0},{"$f":"B5B!H162","v":0},{"$f":"B5B!I162","v":0},0,0,{"$f":"B5B!L162","v":0},{"$f":"B5B!M162","v":0}]
["Capital multi-year expenditure sub-total",3,{"$f":"SUM(C8:C22)","v":123993246.81},{"$f":"SUM(D8:D22)","v":0},0,0,0,0,-14746528,{"$f":"SUM(J8:J22)","v":-14746528},{"$f":"SUM(K8:K22)","v":109246718.81},{"$f":"SUM(L8:L22)","v":113395226},{"$f":"SUM(M8:M22)","v":137203839}]
[]
["Single-year expenditure to be adjusted",2]
[{"$f":"B5B!A177","v":"Vote 1 - Executive & Council"},null,{"$f":"B5B!C177","v":0},{"$f":"B5B!D177","v":0},{"$f":"B5B!E177","v":0},{"$f":"B5B!F177","v":0},{"$f":"B5B!G177","v":0},{"$f":"B5B!H177","v":0},{"$f":"B5B!I177","v":0},{"$f":"SUM(E26:I26)","v":0},{"$f":"IF(D26=0,C26+J26,D26+J26)","v":0},{"$f":"B5B!L177","v":0},{"$f":"B5B!M177","v":0}]
[{"$f":"B5B!A188","v":"Vote 2 - Finance and Administration"},null,{"$f":"B5B!C188","v":7086000},{"$f":"B5B!D188","v":0},{"$f":"B5B!E188","v":0},{"$f":"B5B!F188","v":0},{"$f":"B5B!G188","v":0},{"$f":"B5B!H188","v":0},{"$f":"B5B!I188","v":-666335},-666335,6419665,{"$f":"B5B!L188","v":2030000},{"$f":"B5B!M188","v":0}]
[{"$f":"B5B!A199","v":"Vote 3 - Internal Audit"},null,{"$f":"B5B!C199","v":0},{"$f":"B5B!D199","v":0},{"$f":"B5B!E199","v":0},{"$f":"B5B!F199","v":0},{"$f":"B5B!G199","v":0},{"$f":"B5B!H199","v":0},{"$f":"B5B!I199","v":0},0,0,{"$f":"B5B!L199","v":0},{"$f":"B5B!M199","v":0}]
[{"$f":"B5B!A210","v":"Vote 4 - Community and Public Safety"},null,{"$f":"B5B!C210","v":400000},{"$f":"B5B!D210","v":0},{"$f":"B5B!E210","v":0},{"$f":"B5B!F210","v":0},{"$f":"B5B!G210","v":0},{"$f":"B5B!H210","v":0},{"$f":"B5B!I210","v":0},0,400000,{"$f":"B5B!L210","v":0},{"$f":"B5B!M210","v":0}]
[{"$f":"B5B!A221","v":"Vote 5 - Sports and Recreation"},null,{"$f":"B5B!C221","v":0},{"$f":"B5B!D221","v":0},{"$f":"B5B!E221","v":0},{"$f":"B5B!F221","v":0},{"$f":"B5B!G221","v":0},{"$f":"B5B!H221","v":0},{"$f":"B5B!I221","v":0},0,0,{"$f":"B5B!L221","v":0},{"$f":"B5B!M221","v":0}]
[{"$f":"B5B!A232","v":"Vote 6 - Housing"},null,{"$f":"B5B!C232","v":0},{"$f":"B5B!D232","v":0},{"$f":"B5B!E232","v":0},{"$f":"B5B!F232","v":0},{"$f":"B5B!G232","v":0},{"$f":"B5B!H232","v":0},{"$f":"B5B!I232","v":0},0,0,{"$f":"B5B!L232","v":0},{"$f":"B5B!M232","v":0}]
[{"$f":"B5B!A243","v":"Vote 7 - Planning and development "},null,{"$f":"B5B!C243","v":0},{"$f":"B5B!D243","v":0},{"$f":"B5B!E243","v":0},{"$f":"B5B!F243","v":0},{"$f":"B5B!G243","v":0},{"$f":"B5B!H243","v":0},{"$f":"B5B!I243","v":0},0,0,{"$f":"B5B!L243","v":0},{"$f":"B5B!M243","v":0}]
[{"$f":"B5B!A254","v":"Vote 8 - Road Transport"},null,{"$f":"B5B!C254","v":17659306.260000002},{"$f":"B5B!D254","v":0},{"$f":"B5B!E254","v":0},{"$f":"B5B!F254","v":0},{"$f":"B5B!G254","v":0},{"$f":"B5B!H254","v":0},{"$f":"B5B!I254","v":1869694},1869694,19529000.260000002,{"$f":"B5B!L254","v":11615000},{"$f":"B5B!M254","v":2342092}]
[{"$f":"B5B!A265","v":"Vote 9 - Energy Sources"},null,{"$f":"B5B!C265","v":18334111.600000001},{"$f":"B5B!D265","v":0},{"$f":"B5B!E265","v":0},{"$f":"B5B!F265","v":0},{"$f":"B5B!G265","v":0},{"$f":"B5B!H265","v":0},{"$f":"B5B!I265","v":8127256},8127256,26461367.600000001,{"$f":"B5B!L265","v":24635000},{"$f":"B5B!M265","v":35169000}]
[{"$f":"B5B!A276","v":"Vote 10 - Waste Water Management"},null,{"$f":"B5B!C276","v":5664654.4500000002},{"$f":"B5B!D276","v":0},{"$f":"B5B!E276","v":0},{"$f":"B5B!F276","v":0},{"$f":"B5B!G276","v":0},{"$f":"B5B!H276","v":0},{"$f":"B5B!I276","v":800000},800000,6464654.4500000002,{"$f":"B5B!L276","v":19013657},{"$f":"B5B!M276","v":17294945}]
[{"$f":"B5B!A287","v":"Vote 11 - Waste Management"},null,{"$f":"B5B!C287","v":6140000},{"$f":"B5B!D287","v":0},{"$f":"B5B!E287","v":0},{"$f":"B5B!F287","v":0},{"$f":"B5B!G287","v":0},{"$f":"B5B!H287","v":0},{"$f":"B5B!I287","v":-1000000},-1000000,5140000,{"$f":"B5B!L287","v":3700000},{"$f":"B5B!M287","v":0}]
[{"$f":"B5B!A298","v":"Vote 12 - [NAME OF VOTE 12]"},null,{"$f":"B5B!C298","v":0},{"$f":"B5B!D298","v":0},{"$f":"B5B!E298","v":0},{"$f":"B5B!F298","v":0},{"$f":"B5B!G298","v":0},{"$f":"B5B!H298","v":0},{"$f":"B5B!I298","v":0},0,{"$f":"IF(D37=0,C37+J37,D37+J37)","v":0},{"$f":"B5B!L298","v":0},{"$f":"B5B!M298","v":0}]
[{"$f":"B5B!A309","v":"Vote 13 - [NAME OF VOTE 13]"},null,{"$f":"B5B!C309","v":0},{"$f":"B5B!D309","v":0},{"$f":"B5B!E309","v":0},{"$f":"B5B!F309","v":0},{"$f":"B5B!G309","v":0},{"$f":"B5B!H309","v":0},{"$f":"B5B!I309","v":0},0,0,{"$f":"B5B!L309","v":0},{"$f":"B5B!M309","v":0}]
[{"$f":"B5B!A320","v":"Vote 14 - [NAME OF VOTE 14]"},null,{"$f":"B5B!C320","v":0},{"$f":"B5B!D320","v":0},{"$f":"B5B!E320","v":0},{"$f":"B5B!F320","v":0},{"$f":"B5B!G320","v":0},{"$f":"B5B!H320","v":0},{"$f":"B5B!I320","v":0},0,0,{"$f":"B5B!L320","v":0},{"$f":"B5B!M320","v":0}]
[{"$f":"B5B!A331","v":"Vote 15 - [NAME OF VOTE 15]"},null,{"$f":"B5B!C331","v":0},{"$f":"B5B!D331","v":0},{"$f":"B5B!E331","v":0},{"$f":"B5B!F331","v":0},{"$f":"B5B!G331","v":0},{"$f":"B5B!H331","v":0},{"$f":"B5B!I331","v":0},0,0,{"$f":"B5B!L331","v":0},{"$f":"B5B!M331","v":0}]
["Capital single-year expenditure sub-total",null,{"$f":"SUM(C26:C40)","v":55284072.310000002},{"$f":"SUM(D26:D40)","v":0},0,0,0,0,9130615,{"$f":"SUM(J26:J40)","v":9130615},{"$f":"SUM(K26:K40)","v":64414687.310000002},{"$f":"SUM(L26:L40)","v":60993657},{"$f":"SUM(M26:M40)","v":54806037}]
["Total Capital Expenditure - Vote",null,{"$f":"C41+C23","v":179277319.12},{"$f":"D41+D23","v":0},0,0,0,0,-5615913,{"$f":"J23+J41","v":-5615913},{"$f":"K23+K41","v":173661406.12},{"$f":"L41+L23","v":174388883},{"$f":"M41+M23","v":192009876}]
[]
["Capital Expenditure - Functional"]
["Governance and administration",null,{"$f":"SUM(C46:C48)","v":7086000},0,0,0,0,0,-666335,{"$f":"SUM(J46:J48)","v":-666335},6419665,2030000,0]
["Executive and council",null,0,null,null,null,null,null,null,{"$f":"SUM(E46:I46)","v":0},{"$f":"IF(D46=0,C46+J46,D46+J46)","v":0}]
["Finance and administration",null,{"$f":"730000+1300000+1446000+3610000","v":7086000},null,null,null,null,null,{"$f":"170000+806838+956827-2600000","v":-666335},{"$f":"SUM(E47:I47)","v":-666335},{"$f":"IF(D47=0,C47+J47,D47+J47)","v":6419665},{"$f":"350000+80000+1600000","v":2030000},0]
["Internal audit",null,0,null,null,null,null,null,null,{"$f":"SUM(E48:I48)","v":0},{"$f":"IF(D48=0,C48+J48,D48+J48)","v":0}]
["Community and public safety",null,{"$f":"SUM(C50:C54)","v":44240432.199999996},0,0,0,0,0,21795,{"$f":"SUM(J50:J54)","v":21795},44262227.199999996,76835415,71001889]
["Community and social services",null,{"$f":"1618446.4+1600000+400000","v":3618446.4},null,null,null,null,null,{"$f":"-500000-1000000","v":-1500000},{"$f":"SUM(E50:I50)","v":-1500000},{"$f":"IF(D50=0,C50+J50,D50+J50)","v":2118446.4},{"$f":"800000+2400000","v":3200000},{"$f":"3000000+4500000","v":7500000}]
["Sport and recreation",null,{"$f":"25235573.8+5593206+5593206","v":36421985.799999997},null,null,null,null,null,{"$f":"3165815+130602-2175064-3144237+2067270","v":44386},{"$f":"SUM(E51:I51)","v":44386},{"$f":"IF(D51=0,C51+J51,D51+J51)","v":36466371.799999997},{"$f":"15402226+8233189+18000000+18000000","v":59635415},{"$f":"20181858+20651031","v":40832889}]
["Public safety",null,4200000,null,null,null,null,null,1477409,{"$f":"SUM(E52:I52)","v":1477409},{"$f":"IF(D52=0,C52+J52,D52+J52)","v":5677409},14000000,22669000]
["Housing",null,0,null,null,null,null,null,0,{"$f":"SUM(E53:I53)","v":0},{"$f":"IF(D53=0,C53+J53,D53+J53)","v":0},0,0]
["Health",null,0,null,null,null,null,null,0,{"$f":"SUM(E54:I54)","v":0},{"$f":"IF(D54=0,C54+J54,D54+J54)","v":0},0,0]
["Economic and environmental services",null,{"$f":"SUM(C56:C58)","v":102012120.61000001},0,0,0,0,0,-11421219,-11421219,90590901.610000014,62174811,91213042]
["Planning and development",null,0,null,null,null,null,null,0,{"$f":"SUM(E56:I56)","v":0},{"$f":"IF(D56=0,C56+J56,D56+J56)","v":0},0,0]
["Road transport",null,{"$f":"31350000+1486306.26+11001978+5283210+7450000+4987800+5503600+5401000+2823000+500000+1948852.39+39005.98+2078851.78+169575.27+3584408.39+16081532.54+2323000","v":102012120.61000001},null,null,null,null,null,{"$f":"-16412343-1330306+769782+1711451+739005+719575+1909462-2727845+2000000+1200000","v":-11421219},{"$f":"SUM(E57:I57)","v":-11421219},{"$f":"IF(D57=0,C57+J57,D57+J57)","v":90590901.610000014},{"$f":"48800000+3115000+10259811","v":62174811},{"$f":"71262930+2342092+16408020+600000+600000","v":91213042}]
["Environmental protection",null,0,null,null,null,null,null,0,{"$f":"SUM(E58:I58)","v":0},{"$f":"IF(D58=0,C58+J58,D58+J58)","v":0}]
["Trading services",null,{"$f":"SUM(C60:C63)","v":25938766.050000001},{"$f":"SUM(D60:D63)","v":0},0,0,0,0,{"$f":"SUM(I60:I63)","v":6450000},{"$f":"SUM(J60:J63)","v":6450000},32388766.050000001,33348657,29794945]
["Energy sources",null,{"$f":"8151111.6+5983000","v":14134111.6},null,null,null,null,null,6650000,{"$f":"SUM(E60:I60)","v":6650000},{"$f":"IF(D60=0,C60+J60,D60+J60)","v":20784111.600000001},10635000,12500000]
["Water management",null,0,null,null,null,null,null,0,{"$f":"SUM(E61:I61)","v":0},{"$f":"IF(D61=0,C61+J61,D61+J61)","v":0},0,0]
["Waste water management",null,5664654.4500000002,null,null,null,null,null,800000,{"$f":"SUM(E62:I62)","v":800000},{"$f":"IF(D62=0,C62+J62,D62+J62)","v":6464654.4500000002},19013657,17294945]
["Waste management",null,6140000,null,null,null,null,null,-1000000,{"$f":"SUM(E63:I63)","v":-1000000},{"$f":"IF(D63=0,C63+J63,D63+J63)","v":5140000},3700000,0]
["Other",null,0,null,null,null,null,null,0,{"$f":"SUM(E64:I64)","v":0},{"$f":"IF(D64=0,C64+J64,D64+J64)","v":0}]
["Total Capital Expenditure - Functional",3,{"$f":"C45+C49+C55+C59+C64","v":179277318.86000001},{"$f":"D45+D49+D55+D59+D64","v":0},0,0,0,0,{"$f":"I45+I49+I55+I59+I64","v":-5615759},-5615759,173661559.86000001,174388883,192009876]
[]
["Funded by:"]
["National Government",null,56460000,null,null,null,null,null,0,{"$f":"SUM(E68:I68)","v":0},{"$f":"IF(D68=0,C68+J68,D68+J68)","v":56460000},57608000,60783000]
["Provincial Government",null,null,null,null,null,null,null,null,{"$f":"SUM(E69:I69)","v":0},{"$f":"IF(D69=0,C69+J69,D69+J69)","v":0}]
["District Municipality",null,null,null,null,null,null,null,null,{"$f":"SUM(E70:I70)","v":0},{"$f":"IF(D70=0,C70+J70,D70+J70)","v":0}]
["Other transfers and grants",null,5983000,null,null,null,null,null,0,{"$f":"SUM(E71:I71)","v":0},{"$f":"IF(D71=0,C71+J71,D71+J71)","v":5983000},10635000,12500000]
["Transfers recognised - capital",4,{"$f":"SUM(C68:C71)","v":62443000},0,0,0,0,0,0,0,62443000,68243000,73283000]
["Public contributions & donations",null,null,null,null,null,null,null,null,{"$f":"SUM(E73:I73)","v":0},{"$f":"IF(D73=0,C73+J73,D73+J73)","v":0}]
["Borrowing",null,null,null,null,null,null,null,null,{"$f":"SUM(E74:I74)","v":0},{"$f":"IF(D74=0,C74+J74,D74+J74)","v":0}]
["Internally generated funds",null,116834318.86,null,null,null,null,null,{"$f":"-8815914+2000000+1200000+155","v":-5615759},{"$f":"SUM(E75:H75)","v":0},{"$f":"IF(D75=0,C75+J75,D75+J75)","v":116834318.86},118557914,115157538]
["Total Capital Funding",null,{"$f":"SUM(C72:C75)","v":179277318.86000001},0,0,0,0,{"$f":"SUM(H72:H75)","v":0},-5615759,0,179277318.86000001,186800914,188440538]
[{"$f":"head27a","v":"References"}]
["1. Municipalities may choose to appropriate for capital expenditure for three years or for one year (if one year appropriation projected expenditure required for yr2 and yr3)."]
["2. Include capital component of PPP unitary payment. Note that capital transfers are only appropriated to municipalities for the budget year"]
["3. Capital expenditure by standard classification must reconcile to the appropriations by vote"]
["4. Must reconcile to supporting table SB7 and to Adjustments Budget Financial Performance (revenue and expenditure)"]
["5. Only complete if a previous adjusted budget has been approved in the same financial year. Reflect most recent adjusted budget."]
["6. Additional cash-backed accumulated funds/unspent funds (MFMA section 18(1)(b) and section 28(2)(e)) identified after the Original Budget approved and after annual financial statements audited (note: only where underspending could not reasonably have been foreseen)"]
["7. Increases of funds approved under MFMA section 31"]
["8. Adjustments approved in accordance with MFMA section 29 "]
["9. Adjustments to transfers from National or Provincial Government"]
["10. Adjusts. = 'Other' Adjustments proposed to be approved; including revenue under-collection (MFMA section 28(2)(a)); additional revenue appropriation on existing programmes (section 28(2))(b); projected savings (section 28(2)(d)); error correction (section 28(2)(f))"]
["11. G = B + C + D + E + F"]
["12. Adjusted Budget H = (A or A1/2 etc) + G"]
[]
["check balance",null,{"$f":"C65-C76","v":0},{"$f":"D65-D76","v":0},{"$f":"E65-E76","v":0},null,null,{"$f":"H65-H76","v":0},{"$f":"I65-I76","v":0},{"$f":"J65-J76","v":-5615759},{"$f":"K65-K76","v":-5615759},{"$f":"L65-L76","v":-12412031},{"$f":"K23-K76","v":-70030600.050000012}]

{"sheet":"B5B","index":13,"n_rows":349,"n_cols":13,"rows_kept":349,"cut":false,"hidden":false,"merged":[[1,0,2,0],[1,1,4,1],[1,2,1,10]]}
[{"$f":"muni&\" - \"&_ADJ5&\" - B\"&\" - \"&Date","v":"LIM332 Greater Letaba - Table B5 Adjustments Capital Expenditure Budget by vote and funding - B - 27 February 2019"}]
[{"$f":"Vdesc","v":"Vote Description"},{"$f":"head27","v":"Ref"},{"$f":"Head2","v":"Budget Year 2018/19"},null,null,null,null,null,null,null,null,{"$f":"Head10","v":"Budget Year +1 2019/20"},{"$f":"Head11","v":"Budget Year +2 2020/21"}]
[null,null,{"$f":"Head6","v":"Original Budget"},{"$f":"Head54","v":"Prior Adjusted"},{"$f":"Head51","v":"Accum. Funds"},{"$f":"Head52","v":"Multi-year capital"},{"$f":"Head53","v":"Unfore. Unavoid."},{"$f":"Head55","v":"Nat. or Prov. Govt"},{"$f":"Head50","v":"Other Adjusts."},{"$f":"Head56","v":"Total Adjusts."},{"$f":"Head7","v":"Adjusted Budget"},{"$f":"Head7","v":"Adjusted Budget"},{"$f":"Head7","v":"Adjusted Budget"}]
["[Insert departmental structure etc]",null,null,3,4,5,6,7,8,9,10]
["R thousands",null,"A","A1","B","C","D","E","F","G","H"]
["Capital expenditure - Municipal Vote"]
["Multi-year expenditure appropriation",2]
[{"$f":"'Org structure'!A2","v":"Vote 1 - Executive & Council"},null,{"$f":"SUM(C9:C18)","v":0},{"$f":"SUM(D9:D18)","v":0},0,0,0,0,0,{"$f":"SUM(E8:I8)","v":0},{"$f":"IF(D8=0,C8+J8,D8+J8)","v":0},{"$f":"SUM(L9:L18)","v":0},{"$f":"SUM(M9:M18)","v":0}]
[{"$f":"'Org structure'!E3","v":"1,1 - Mayor and Council"},null,null,null,null,null,null,null,null,0,0]
[{"$f":"'Org structure'!E4","v":"1,2 - Municipal Manager"},null,null,null,null,null,null,null,null,0,0]
[{"$f":"'Org structure'!E5","v":0},null,null,null,null,null,null,null,null,0,0]
[{"$f":"'Org structure'!E6","v":0},null,null,null,null,null,null,null,null,0,0]
[{"$f":"'Org structure'!E7","v":0},null,null,null,null,null,null,null,null,0,0]
[{"$f":"'Org structure'!E8","v":0},null,null,null,null,null,null,null,null,0,0]
[{"$f":"'Org structure'!E9","v":0},null,null,null,null,null,null,null,null,0,0]
[{"$f":"'Org structure'!E10","v":0},null,null,null,null,null,null,null,null,0,0]
[{"$f":"'Org structure'!E11","v":0},null,null,null,null,null,null,null,null,0,0]
[{"$f":"'Org structure'!E12","v":0},null,null,null,null,null,null,null,null,0,0]
[{"$f":"'Org structure'!A3","v":"Vote 2 - Finance and Administration"},null,{"$f":"SUM(C20:C29)","v":0},{"$f":"SUM(D20:D29)","v":0},0,0,0,0,0,0,0,{"$f":"SUM(L20:L29)","v":0},{"$f":"SUM(M20:M29)","v":0}]
[{"$f":"'Org structure'!E14","v":"2,1 - Administrative and Corporate Support"},null,null,null,null,null,null,null,null,0,0]
[{"$f":"'Org structure'!E15","v":"2,2 - Asset Management"},null,null,null,null,null,null,null,null,0,0]
[{"$f":"'Org structure'!E16","v":"2,3 - Budget and Treasury Office"},null,null,null,null,null,null,null,null,0,0]
[{"$f":"'Org structure'!E17","v":"2,4 - Human Resource"},null,null,null,null,null,null,null,null,0,0]
[{"$f":"'Org structure'!E18","v":"2,5 - Information Technology"},null,null,null,null,null,null,null,null,0,0]
[{"$f":"'Org structure'!E19","v":"2,6 - Legal Services"},null,null,null,null,null,null,null,null,0,0]
[{"$f":"'Org structure'!E20","v":"2,7 - Customer Relation and Coordination"},null,null,null,null,null,null,null,null,0,0]
[{"$f":"'Org structure'!E21","v":"2,8 - Property Services"},null,null,null,null,null,null,null,null,0,0]
[{"$f":"'Org structure'!E22","v":"2,9 - Risk Management"},null,null,null,null,null,null,null,null,0,0]
[{"$f":"'Org structure'!E23","v":"2.10 - Supply Chain Management"},null,null,null,null,null,null,null,null,0,0]
[{"$f":"'Org structure'!A4","v":"Vote 3 - Internal Audit"},null,{"$f":"SUM(C31:C40)","v":0},{"$f":"SUM(D31:D40)","v":0},0,0,0,0,0,0,0,{"$f":"SUM(L31:L40)","v":0},{"$f":"SUM(M31:M40)","v":0}]
[{"$f":"'Org structure'!E25","v":"3,1 - Governance Function"},null,null,null,null,null,null,null,null,0,0]
[{"$f":"'Org structure'!E26","v":0},null,null,null,null,null,null,null,null,0,0]
[{"$f":"'Org structure'!E27","v":0},null,null,null,null,null,null,null,null,0,0]
[{"$f":"'Org structure'!E28","v":0},null,null,null,null,null,null,null,null,0,0]
[{"$f":"'Org structure'!E29","v":0},null,null,null,null,null,null,null,null,0,0]
[{"$f":"'Org structure'!E30","v":0},null,null,null,null,null,null,null,null,0,0]
[{"$f":"'Org structure'!E31","v":0},null,null,null,null,null,null,null,null,0,0]
[{"$f":"'Org structure'!E32","v":0},null,null,null,null,null,null,null,null,0,0]
[{"$f":"'Org structure'!E33","v":0},null,null,null,null,null,null,null,null,0,0]
[{"$f":"'Org structure'!E34","v":0},null,null,null,null,null,null,null,null,0,0]
[{"$f":"'Org structure'!A5","v":"Vote 4 - Community and Public Safety"},null,{"$f":"SUM(C42:C51)","v":3218446},{"$f":"SUM(D42:D51)","v":0},0,0,0,0,-1500000,-1500000,1718446,{"$f":"SUM(L42:L51)","v":3200000},{"$f":"SUM(M42:M51)","v":7500000}]
[{"$f":"'Org structure'!E36","v":"4,1 - Cemetries and crematoriums"},null,0,null,null,null,null,null,0,0,0,0,0]
[{"$f":"'Org structure'!E37","v":"4,2 - Community halls and Facilities"},null,{"$f":"600000+600000+400000","v":1600000},null,null,null,null,null,-1000000,-1000000,600000,2400000,4500000]
[{"$f":"'Org structure'!E38","v":"4,3 - Disaster Management"},null,0,null,null,null,null,null,0,0,0,0,0]
[{"$f":"'Org structure'!E39","v":"4,4 - Libraries and Archives"},null,{"$f":"500000+1118446","v":1618446},null,null,null,null,null,-500000,-500000,1118446,800000,3000000]
[{"$f":"'Org structure'!E40","v":0},null,null,null,null,null,null,null,null,0,0,0,0]
[{"$f":"'Org structure'!E41","v":0},null,null,null,null,null,null,null,null,0,0,0,0]
[{"$f":"'Org structure'!E42","v":0},null,null,null,null,null,null,null,null,0,0,0,0]
[{"$f":"'Org structure'!E43","v":0},null,null,null,null,null,null,null,null,0,0,0,0]
[{"$f":"'Org structure'!E44","v":0},null,null,null,null,null,null,null,null,0,0,0,0]
[{"$f":"'Org structure'!E45","v":0},null,null,null,null,null,null,null,null,0,0,0,0]
[{"$f":"'Org structure'!A6","v":"Vote 5 - Sports and Recreation"},null,{"$f":"SUM(C53:C62)","v":63505497},{"$f":"SUM(D53:D62)","v":0},0,0,0,0,3165815,3165815,66671312,{"$f":"SUM(L53:L62)","v":59635415},{"$f":"SUM(M53:M62)","v":40832889}]
[{"$f":"'Org structure'!E47","v":"5,1 - Community parks"},null,{"$f":"13050771+11884803+11001978+5593206+5593206+16081533+300000","v":63505497},null,null,null,null,null,3165815,3165815,66671312,59635415,40832889]
[{"$f":"'Org structure'!E48","v":0},null,null,null,null,null,null,null,null,0,0]
[{"$f":"'Org structure'!E49","v":0},null,null,null,null,null,null,null,null,0,0]
[{"$f":"'Org structure'!E50","v":0},null,null,null,null,null,null,null,null,0,0]
[{"$f":"'Org structure'!E51","v":0},null,null,null,null,null,null,null,null,0,0]
[{"$f":"'Org structure'!E52","v":0},null,null,null,null,null,null,null,null,0,0]
[{"$f":"'Org structure'!E53","v":0},null,null,null,null,null,null,null,null,0,0]
[{"$f":"'Org structure'!E54","v":0},null,null,null,null,null,null,null,null,0,0]
[{"$f":"'Org structure'!E55","v":0},null,null,null,null,null,null,null,null,0,0]
[{"$f":"'Org structure'!E56","v":0},null,null,null,null,null,null,null,null,0,0]
[{"$f":"'Org structure'!A7","v":"Vote 6 - Housing"},null,{"$f":"SUM(C64:C73)","v":0},{"$f":"SUM(D64:D73)","v":0},0,0,0,0,0,0,0,{"$f":"SUM(L64:L73)","v":0},{"$f":"SUM(M64:M73)","v":0}]
[{"$f":"'Org structure'!E58","v":"6,1 - Housing"},null,null,null,null,null,null,null,null,0,0]
[{"$f":"'Org structure'!E59","v":0},null,null,null,null,null,null,null,null,0,0]
[{"$f":"'Org structure'!E60","v":0},null,null,null,null,null,null,null,null,0,0]
[{"$f":"'Org structure'!E61","v":0},null,null,null,null,null,null,null,null,0,0]
[{"$f":"'Org structure'!E62","v":0},null,null,null,null,null,null,null,null,0,0]
[{"$f":"'Org structure'!E63","v":0},null,null,null,null,null,null,null,null,0,0]
[{"$f":"'Org structure'!E64","v":0},null,null,null,null,null,null,null,null,0,0]
[{"$f":"'Org structure'!E65","v":0},null,null,null,null,null,null,null,null,0,0]
[{"$f":"'Org structure'!E66","v":0},null,null,null,null,null,null,null,null,{"$f":"SUM(E72:I72)","v":0},{"$f":"IF(D72=0,C72+J72,D72+J72)","v":0}]
[{"$f":"'Org structure'!E67","v":0},null,null,null,null,null,null,null,null,0,0]
[{"$f":"'Org structure'!A8","v":"Vote 7 - Planning and development "},null,{"$f":"SUM(C75:C84)","v":0},{"$f":"SUM(D75:D84)","v":0},0,0,0,0,0,0,0,{"$f":"SUM(L75:L84)","v":0},{"$f":"SUM(M75:M84)","v":0}]
[{"$f":"'Org structure'!E69","v":"7,1 - Corporate Wide Strategic Planning (IDP & LED)"},null,null,null,null,null,null,null,null,0,0]
[{"$f":"'Org structure'!E70","v":"7,2 - Town Planning and Building Regulations"},null,null,null,null,null,null,null,null,0,0]
[{"$f":"'Org structure'!E71","v":"7,3 - Project Management Unit"},null,null,null,null,null,null,null,null,0,0]
[{"$f":"'Org structure'!E72","v":0},null,null,null,null,null,null,null,null,0,0]
[{"$f":"'Org structure'!E73","v":0},null,null,null,null,null,null,null,null,0,0]
[{"$f":"'Org structure'!E74","v":0},null,null,null,null,null,null,null,null,0,0]
[{"$f":"'Org structure'!E75","v":0},null,null,null,null,null,null,null,null,0,0]
[{"$f":"'Org structure'!E76","v":0},null,null,null,null,null,null,null,null,0,0]
[{"$f":"'Org structure'!E77","v":0},null,null,null,null,null,null,null,null,0,0]
[{"$f":"'Org structure'!E78","v":0},null,null,null,null,null,null,null,null,0,0]
[{"$f":"'Org structure'!A9","v":"Vote 8 - Road Transport"},null,{"$f":"SUM(C86:C95)","v":57269303.810000002},{"$f":"SUM(D86:D95)","v":0},0,0,0,0,-16412343,-16412343,40856960.810000002,{"$f":"SUM(L86:L95)","v":50559811},{"$f":"SUM(M86:M95)","v":88870950}]
[{"$f":"'Org structure'!E80","v":"8,1 - Road and Traffic Regulations"},null,null,null,null,null,null,null,null,0,0,0,0]
[{"$f":"'Org structure'!E81","v":"8,2 - Roads"},null,{"$f":"500000+800000+800000+800000+6000000+400000+600000+600000+7000000+5283210+7450000+4987800+5503600+5401000+1000000+1948852.39+39005.98+2078851.78+169575.27+3584408.39+2323000","v":57269303.810000002},null,null,null,null,null,-16412343,-16412343,40856960.810000002,50559811,88870950]
[{"$f":"'Org structure'!E82","v":"8,3 - Taxi Ranks"},null,null,null,null,null,null,null,null,0,0]
[{"$f":"'Org structure'!E83","v":0},null,null,null,null,null,null,null,null,0,0]
[{"$f":"'Org structure'!E84","v":0},null,null,null,null,null,null,null,null,0,0]
[{"$f":"'Org structure'!E85","v":0},null,null,null,null,null,null,null,null,0,0]
[{"$f":"'Org structure'!E86","v":0},null,null,null,null,null,null,null,null,0,0]
[{"$f":"'Org structure'!E87","v":0},null,null,null,null,null,null,null,null,0,0]
[{"$f":"'Org structure'!E88","v":0},null,null,null,null,null,null,null,null,0,0]
[{"$f":"'Org structure'!E89","v":0},null,null,null,null,null,null,null,null,0,0]
[{"$f":"'Org structure'!A10","v":"Vote 9 - Energy Sources"},null,{"$f":"SUM(C97:C106)","v":0},{"$f":"SUM(D97:D106)","v":0},0,0,0,0,0,0,0,{"$f":"SUM(L97:L106)","v":0},{"$f":"SUM(M97:M106)","v":0}]
[{"$f":"'Org structure'!E91","v":"9,1 - Electricity"},null,null,null,null,null,null,null,null,0,0]
[{"$f":"'Org structure'!E92","v":"9,2 - Street Lighting"},null,null,null,null,null,null,null,null,0,0]
[{"$f":"'Org structure'!E93","v":0},null,null,null,null,null,null,null,null,0,0]
[{"$f":"'Org structure'!E94","v":0},null,null,null,null,null,null,null,null,0,0]
[{"$f":"'Org structure'!E95","v":0},null,null,null,null,null,null,null,null,0,0]
[{"$f":"'Org structure'!E96","v":0},null,null,null,null,null,null,null,null,0,0]
[{"$f":"'Org structure'!E97","v":0},null,null,null,null,null,null,null,null,0,0]
[{"$f":"'Org structure'!E98","v":0},null,null,null,null,null,null,null,null,0,0]
[{"$f":"'Org structure'!E99","v":0},null,null,null,null,null,null,null,null,0,0]
[{"$f":"'Org structure'!E100","v":0},null,null,null,null,null,null,null,null,0,0]
[{"$f":"'Org structure'!A11","v":"Vote 10 - Waste Water Management"},null,{"$f":"SUM(C108:C117)","v":0},{"$f":"SUM(D108:D117)","v":0},0,0,0,0,0,0,0,{"$f":"SUM(L108:L117)","v":0},{"$f":"SUM(M108:M117)","v":0}]
[{"$f":"'Org structure'!E102","v":"10,1 - Public Toilets"},null,null,null,null,null,null,null,null,0,0]
[{"$f":"'Org structure'!E103","v":0},null,null,null,null,null,null,null,null,0,0]
[{"$f":"'Org structure'!E104","v":0},null,null,null,null,null,null,null,null,0,0]
[{"$f":"'Org structure'!E105","v":0},null,null,null,null,null,null,null,null,0,0]
[{"$f":"'Org structure'!E106","v":0},null,null,null,null,null,null,null,null,0,0]
[{"$f":"'Org structure'!E107","v":0},null,null,null,null,null,null,null,null,0,0]
[{"$f":"'Org structure'!E108","v":0},null,null,null,null,null,null,null,null,0,0]
[{"$f":"'Org structure'!E109","v":0},null,null,null,null,null,null,null,null,0,0]
[{"$f":"'Org structure'!E110","v":0},null,null,null,null,null,null,null,null,0,0]
[{"$f":"'Org structure'!E111","v":0},null,null,null,null,null,null,null,null,0,0]
[{"$f":"'Org structure'!A12","v":"Vote 11 - Waste Management"},null,{"$f":"SUM(C119:C128)","v":0},{"$f":"SUM(D119:D128)","v":0},0,0,0,0,0,0,0,{"$f":"SUM(L119:L128)","v":0},{"$f":"SUM(M119:M128)","v":0}]
[{"$f":"'Org structure'!E113","v":"11,1 - Solid Waste Removal"},null,null,null,null,null,null,null,null,0,0]
[{"$f":"'Org structure'!E114","v":0},null,null,null,null,null,null,null,null,0,0]
[{"$f":"'Org structure'!E115","v":0},null,null,null,null,null,null,null,null,0,0]
[{"$f":"'Org structure'!E116","v":0},null,null,null,null,null,null,null,null,0,0]
[{"$f":"'Org structure'!E117","v":0},null,null,null,null,null,null,null,null,0,0]
[{"$f":"'Org structure'!E118","v":0},null,null,null,null,null,null,null,null,0,0]
[{"$f":"'Org structure'!E119","v":0},null,null,null,null,null,null,null,null,0,0]
[{"$f":"'Org structure'!E120","v":0},null,null,null,null,null,null,null,null,0,0]
[{"$f":"'Org structure'!E121","v":0},null,null,null,null,null,null,null,null,0,0]
[{"$f":"'Org structure'!E122","v":0},null,null,null,null,null,null,null,null,0,0]
[{"$f":"'Org structure'!A13","v":"Vote 12 - [NAME OF VOTE 12]"},null,{"$f":"SUM(C130:C139)","v":0},{"$f":"SUM(D130:D139)","v":0},0,0,0,0,0,0,0,{"$f":"SUM(L130:L139)","v":0},{"$f":"SUM(M130:M139)","v":0}]
[{"$f":"'Org structure'!E124","v":"12.1 - [Name of sub-vote]"},null,null,null,null,null,null,null,null,0,0]
[{"$f":"'Org structure'!E125","v":0},null,null,null,null,null,null,null,null,0,0]
[{"$f":"'Org structure'!E126","v":0},null,null,null,null,null,null,null,null,0,0]
[{"$f":"'Org structure'!E127","v":0},null,null,null,null,null,null,null,null,0,0]
[{"$f":"'Org structure'!E128","v":0},null,null,null,null,null,null,null,null,0,0]
[{"$f":"'Org structure'!E129","v":0},null,null,null,null,null,null,null,null,0,0]
[{"$f":"'Org structure'!E130","v":0},null,null,null,null,null,null,null,null,{"$f":"SUM(E136:I136)","v":0},{"$f":"IF(D136=0,C136+J136,D136+J136)","v":0}]
[{"$f":"'Org structure'!E131","v":0},null,null,null,null,null,null,null,null,0,0]
[{"$f":"'Org structure'!E132","v":0},null,null,null,null,null,null,null,null,0,0]
[{"$f":"'Org structure'!E133","v":0},null,null,null,null,null,null,null,null,0,0]
[{"$f":"'Org structure'!A14","v":"Vote 13 - [NAME OF VOTE 13]"},null,{"$f":"SUM(C141:C150)","v":0},{"$f":"SUM(D141:D150)","v":0},0,0,0,0,0,0,0,{"$f":"SUM(L141:L150)","v":0},{"$f":"SUM(M141:M150)","v":0}]
[{"$f":"'Org structure'!E135","v":"13.1 - [Name of sub-vote]"},null,null,null,null,null,null,null,null,0,0]
[{"$f":"'Org structure'!E136","v":0},null,null,null,null,null,null,null,null,0,0]
[{"$f":"'Org structure'!E137","v":0},null,null,null,null,null,null,null,null,0,0]
[{"$f":"'Org structure'!E138","v":0},null,null,null,null,null,null,null,null,0,0]
[{"$f":"'Org structure'!E139","v":0},null,null,null,null,null,null,null,null,0,0]
[{"$f":"'Org structure'!E140","v":0},null,null,null,null,null,null,null,null,0,0]
[{"$f":"'Org structure'!E141","v":0},null,null,null,null,null,null,null,null,0,0]
[{"$f":"'Org structure'!E142","v":0},null,null,null,null,null,null,null,null,0,0]
[{"$f":"'Org structure'!E143","v":0},null,null,null,null,null,null,null,null,0,0]
[{"$f":"'Org structure'!E144","v":0},null,null,null,null,null,null,null,null,0,0]
[{"$f":"'Org structure'!A15","v":"Vote 14 - [NAME OF VOTE 14]"},null,{"$f":"SUM(C152:C161)","v":0},{"$f":"SUM(D152:D161)","v":0},0,0,0,0,0,0,0,{"$f":"SUM(L152:L161)","v":0},{"$f":"SUM(M152:M161)","v":0}]
[{"$f":"'Org structure'!E146","v":"14.1 - [Name of sub-vote]"},null,null,null,null,null,null,null,null,0,0]
[{"$f":"'Org structure'!E147","v":0},null,null,null,null,null,null,null,null,0,0]
[{"$f":"'Org structure'!E148","v":0},null,null,null,null,null,null,null,null,0,0]
[{"$f":"'Org structure'!E149","v":0},null,null,null,null,null,null,null,null,0,0]
[{"$f":"'Org structure'!E150","v":0},null,null,null,null,null,null,null,null,0,0]
[{"$f":"'Org structure'!E151","v":0},null,null,null,null,null,null,null,null,0,0]
[{"$f":"'Org structure'!E152","v":0},null,null,null,null,null,null,null,null,0,0]
[{"$f":"'Org structure'!E153","v":0},null,null,null,null,null,null,null,null,0,0]
[{"$f":"'Org structure'!E154","v":0},null,null,null,null,null,null,null,null,0,0]
[{"$f":"'Org structure'!E155","v":0},null,null,null,null,null,null,null,null,0,0]
[{"$f":"'Org structure'!A16","v":"Vote 15 - [NAME OF VOTE 15]"},null,{"$f":"SUM(C163:C172)","v":0},{"$f":"SUM(D163:D172)","v":0},0,0,0,0,0,0,0,{"$f":"SUM(L163:L172)","v":0},{"$f":"SUM(M163:M172)","v":0}]
[{"$f":"'Org structure'!E157","v":"15.1 - [Name of sub-vote]"},null,null,null,null,null,null,null,null,0,0]
[{"$f":"'Org structure'!E158","v":0},null,null,null,null,null,null,null,null,0,0]
[{"$f":"'Org structure'!E159","v":0},null,null,null,null,null,null,null,null,0,0]
[{"$f":"'Org structure'!E160","v":0},null,null,null,null,null,null,null,null,0,0]
[{"$f":"'Org structure'!E161","v":0},null,null,null,null,null,null,null,null,0,0]
[{"$f":"'Org structure'!E162","v":0},null,null,null,null,null,null,null,null,0,0]
[{"$f":"'Org structure'!E163","v":0},null,null,null,null,null,null,null,null,0,0]
[{"$f":"'Org structure'!E164","v":0},null,null,null,null,null,null,null,null,0,0]
[{"$f":"'Org structure'!E165","v":0},null,null,null,null,null,null,null,null,0,0]
[{"$f":"'Org structure'!E166","v":0},null,null,null,null,null,null,null,null,0,0]
["Capital multi-year expenditure sub-total",null,{"$f":"C8+C19+C30+C41+C52+C63+C74+C85+C96+C107+C118+C129+C140+C151+C162","v":123993246.81},{"$f":"D8+D19+D30+D41+D52+D63+D74+D85+D96+D107+D118+D129+D140+D151+D162","v":0},0,0,0,0,-14746528,-14746528,109246718.81,{"$f":"L8+L19+L30+L41+L52+L63+L74+L85+L96+L107+L118+L129+L140+L151+L162","v":113395226},{"$f":"M8+M19+M30+M41+M52+M63+M74+M85+M96+M107+M118+M129+M140+M151+M162","v":137203839}]
[]
["Capital expenditure - Municipal Vote",2]
["Single-year expenditure appropriation"]
[{"$f":"B5B!A8","v":"Vote 1 - Executive & Council"},null,{"$f":"SUM(C178:C187)","v":0},{"$f":"SUM(D178:D187)","v":0},0,0,0,0,0,{"$f":"SUM(E177:I177)","v":0},{"$f":"IF(D177=0,C177+J177,D177+J177)","v":0},{"$f":"SUM(L178:L187)","v":0},{"$f":"SUM(M178:M187)","v":0}]
[{"$f":"B5B!A9","v":"1,1 - Mayor and Council"},null,null,null,null,null,null,null,null,0,0,0,0]
[{"$f":"B5B!A10","v":"1,2 - Municipal Manager"},null,null,null,null,null,null,null,null,0,0,0,0]
[{"$f":"B5B!A11","v":0},null,null,null,null,null,null,null,null,0,0]
[{"$f":"B5B!A12","v":0},null,null,null,null,null,null,null,null,0,0]
[{"$f":"B5B!A13","v":0},null,null,null,null,null,null,null,null,0,0]
[{"$f":"B5B!A14","v":0},null,null,null,null,null,null,null,null,0,0]
[{"$f":"B5B!A15","v":0},null,null,null,null,null,null,null,null,0,0]
[{"$f":"B5B!A16","v":0},null,null,null,null,null,null,null,null,0,0]
[{"$f":"B5B!A17","v":0},null,null,null,null,null,null,null,null,0,0]
[{"$f":"B5B!A18","v":0},null,null,null,null,null,null,null,null,0,0]
[{"$f":"B5B!A19","v":"Vote 2 - Finance and Administration"},null,{"$f":"SUM(C189:C198)","v":7086000},{"$f":"SUM(D189:D198)","v":0},0,0,0,0,-666335,-666335,6419665,{"$f":"SUM(L189:L198)","v":2030000},{"$f":"SUM(M189:M198)","v":0}]
[{"$f":"B5B!A20","v":"2,1 - Administrative and Corporate Support"},null,0,null,null,null,null,null,null,0,0,0,0]
[{"$f":"B5B!A21","v":"2,2 - Asset Management"},null,0,null,null,null,null,null,null,0,0,0,0]
[{"$f":"B5B!A22","v":"2,3 - Budget and Treasury Office"},null,730000,null,null,null,null,null,170000,170000,900000,80000,0]
[{"$f":"B5B!A23","v":"2,4 - Human Resource"},null,1300000,null,null,null,null,null,806838,806838,2106838,0,0]
[{"$f":"B5B!A24","v":"2,5 - Information Technology"},null,1446000,null,null,null,null,null,956827,956827,2402827,350000,0]
[{"$f":"B5B!A25","v":"2,6 - Legal Services"},null,0,null,null,null,null,null,0,0,0,0,0]
[{"$f":"B5B!A26","v":"2,7 - Customer Relation and Coordination"},null,0,null,null,null,null,null,0,0,0,0,0]
[{"$f":"B5B!A27","v":"2,8 - Property Services"},null,3610000,null,null,null,null,null,-2600000,-2600000,1010000,1600000,0]
[{"$f":"B5B!A28","v":"2,9 - Risk Management"},null,0,null,null,null,null,null,null,0,0]
[{"$f":"B5B!A29","v":"2.10 - Supply Chain Management"},null,0,null,null,null,null,null,null,0,0]
[{"$f":"B5B!A30","v":"Vote 3 - Internal Audit"},null,{"$f":"SUM(C200:C209)","v":0},{"$f":"SUM(D200:D209)","v":0},0,0,0,0,0,0,0,{"$f":"SUM(L200:L209)","v":0},{"$f":"SUM(M200:M209)","v":0}]
[{"$f":"B5B!A31","v":"3,1 - Governance Function"},null,null,null,null,null,null,null,null,0,0]
[{"$f":"B5B!A32","v":0},null,null,null,null,null,null,null,null,0,0]
[{"$f":"B5B!A33","v":0},null,null,null,null,null,null,null,null,0,0]
[{"$f":"B5B!A34","v":0},null,null,null,null,null,null,null,null,0,0]
[{"$f":"B5B!A35","v":0},null,null,null,null,null,null,null,null,0,0]
[{"$f":"B5B!A36","v":0},null,null,null,null,null,null,null,null,0,0]
[{"$f":"B5B!A37","v":0},null,null,null,null,null,null,null,null,0,0]
[{"$f":"B5B!A38","v":0},null,null,null,null,null,null,null,null,0,0]
[{"$f":"B5B!A39","v":0},null,null,null,null,null,null,null,null,0,0]
[{"$f":"B5B!A40","v":0},null,null,null,null,null,null,null,null,0,0]
[{"$f":"B5B!A41","v":"Vote 4 - Community and Public Safety"},null,{"$f":"SUM(C211:C220)","v":400000},0,0,0,0,0,0,0,400000,{"$f":"SUM(L211:L220)","v":0},{"$f":"SUM(M211:M220)","v":0}]
[{"$f":"B5B!A42","v":"4,1 - Cemetries and crematoriums"},null,400000,null,null,null,null,null,0,0,400000,0,0]
[{"$f":"B5B!A43","v":"4,2 - Community halls and Facilities"},null,0,null,null,null,null,null,null,0,0]
[{"$f":"B5B!A44","v":"4,3 - Disaster Management"},null,0,null,null,null,null,null,null,0,0]
[{"$f":"B5B!A45","v":"4,4 - Libraries and Archives"},null,0,null,null,null,null,null,null,0,0]
[{"$f":"B5B!A46","v":0},null,null,null,null,null,null,null,null,0,0]
[{"$f":"B5B!A47","v":0},null,null,null,null,null,null,null,null,0,0]
[{"$f":"B5B!A48","v":0},null,null,null,null,null,null,null,null,0,0]
[{"$f":"B5B!A49","v":0},null,null,null,null,null,null,null,null,0,0]
[{"$f":"B5B!A50","v":0},null,null,null,null,null,null,null,null,0,0]
[{"$f":"B5B!A51","v":0},null,null,null,null,null,null,null,null,0,0]
[{"$f":"B5B!A52","v":"Vote 5 - Sports and Recreation"},null,{"$f":"SUM(C222:C231)","v":0},0,0,0,0,0,0,0,0,{"$f":"SUM(L222:L231)","v":0},{"$f":"SUM(M222:M231)","v":0}]
[{"$f":"B5B!A53","v":"5,1 - Community parks"},null,null,null,null,null,null,null,null,0,0]
[{"$f":"B5B!A54","v":0},null,null,null,null,null,null,null,null,0,0]
[{"$f":"B5B!A55","v":0},null,null,null,null,null,null,null,null,0,0]
[{"$f":"B5B!A56","v":0},null,null,null,null,null,null,null,null,0,0]
[{"$f":"B5B!A57","v":0},null,null,null,null,null,null,null,null,0,0]
[{"$f":"B5B!A58","v":0},null,null,null,null,null,null,null,null,0,0]
[{"$f":"B5B!A59","v":0},null,null,null,null,null,null,null,null,0,0]
[{"$f":"B5B!A60","v":0},null,null,null,null,null,null,null,null,0,0]
[{"$f":"B5B!A61","v":0},null,null,null,null,null,null,null,null,0,0]
[{"$f":"B5B!A62","v":0},null,null,null,null,null,null,null,null,0,0]
[{"$f":"B5B!A63","v":"Vote 6 - Housing"},null,{"$f":"SUM(C233:C242)","v":0},0,0,0,0,0,0,0,0,{"$f":"SUM(L233:L242)","v":0},{"$f":"SUM(M233:M242)","v":0}]
[{"$f":"B5B!A64","v":"6,1 - Housing"},null,null,null,null,null,null,null,null,0,0]
[{"$f":"B5B!A65","v":0},null,null,null,null,null,null,null,null,0,0]
[{"$f":"B5B!A66","v":0},null,null,null,null,null,null,null,null,0,0]
[{"$f":"B5B!A67","v":0},null,null,null,null,null,null,null,null,0,0]
[{"$f":"B5B!A68","v":0},null,null,null,null,null,null,null,null,0,0]
[{"$f":"B5B!A69","v":0},null,null,null,null,null,null,null,null,0,0]
[{"$f":"B5B!A70","v":0},null,null,null,null,null,null,null,null,0,0]
[{"$f":"B5B!A71","v":0},null,null,null,null,null,null,null,null,0,0]
[{"$f":"B5B!A72","v":0},null,null,null,null,null,null,null,null,{"$f":"SUM(E241:I241)","v":0},{"$f":"IF(D241=0,C241+J241,D241+J241)","v":0}]
[{"$f":"B5B!A73","v":0},null,null,null,null,null,null,null,null,0,0]
[{"$f":"B5B!A74","v":"Vote 7 - Planning and development "},null,{"$f":"SUM(C244:C253)","v":0},0,0,0,0,0,0,0,0,{"$f":"SUM(L244:L253)","v":0},{"$f":"SUM(M244:M253)","v":0}]
[{"$f":"B5B!A75","v":"7,1 - Corporate Wide Strategic Planning (IDP & LED)"},null,null,null,null,null,null,null,null,0,0]
[{"$f":"B5B!A76","v":"7,2 - Town Planning and Building Regulations"},null,null,null,null,null,null,null,null,0,0]
[{"$f":"B5B!A77","v":"7,3 - Project Management Unit"},null,null,null,null,null,null,null,null,0,0]
[{"$f":"B5B!A78","v":0},null,null,null,null,null,null,null,null,0,0]
[{"$f":"B5B!A79","v":0},null,null,null,null,null,null,null,null,0,0]
[{"$f":"B5B!A80","v":0},null,null,null,null,null,null,null,null,0,0]
[{"$f":"B5B!A81","v":0},null,null,null,null,null,null,null,null,0,0]
[{"$f":"B5B!A82","v":0},null,null,null,null,null,null,null,null,0,0]
[{"$f":"B5B!A83","v":0},null,null,null,null,null,null,null,null,0,0]
[{"$f":"B5B!A84","v":0},null,null,null,null,null,null,null,null,0,0]
[{"$f":"B5B!A85","v":"Vote 8 - Road Transport"},null,{"$f":"SUM(C255:C264)","v":17659306.260000002},0,0,0,0,0,1869694,1869694,19529000.260000002,{"$f":"SUM(L255:L264)","v":11615000},{"$f":"SUM(M255:M264)","v":2342092}]
[{"$f":"B5B!A86","v":"8,1 - Road and Traffic Regulations"},null,1486306.26,null,null,null,null,null,-1330306,-1330306,156000.26,0,0]
[{"$f":"B5B!A87","v":"8,2 - Roads"},null,{"$f":"2500000+1400000+1200000+400000+250000+500000+700000+2500000+1700000+1200000+2823000+500000+500000","v":16173000},null,null,null,null,null,{"$f":"1200000+2000000","v":3200000},3200000,19373000,{"$f":"6000000+500000+1200000+800000+3115000","v":11615000},2342092]
[{"$f":"B5B!A88","v":"8,3 - Taxi Ranks"},null,0,null,null,null,null,null,0,0,0,0,0]
[{"$f":"B5B!A89","v":0},null,null,null,null,null,null,null,null,0,0]
[{"$f":"B5B!A90","v":0},null,null,null,null,null,null,null,null,0,0]
[{"$f":"B5B!A91","v":0},null,null,null,null,null,null,null,null,0,0]
[{"$f":"B5B!A92","v":0},null,null,null,null,null,null,null,null,0,0]
[{"$f":"B5B!A93","v":0},null,null,null,null,null,null,null,null,0,0]
[{"$f":"B5B!A94","v":0},null,null,null,null,null,null,null,null,0,0]
[{"$f":"B5B!A95","v":0},null,null,null,null,null,null,null,null,0,0]
[{"$f":"B5B!A96","v":"Vote 9 - Energy Sources"},null,{"$f":"SUM(C266:C275)","v":18334111.600000001},0,0,0,0,0,8127256,8127256,26461367.600000001,{"$f":"SUM(L266:L275)","v":24635000},{"$f":"SUM(M266:M275)","v":35169000}]
[{"$f":"B5B!A97","v":"9,1 - Electricity"},null,{"$f":"8151111.6+5983000","v":14134111.6},null,null,null,null,null,6650000,6650000,20784111.600000001,10635000,12500000]
[{"$f":"B5B!A98","v":"9,2 - Street Lighting"},null,4200000,null,null,null,null,null,1477256,1477256,5677256,14000000,22669000]
[{"$f":"B5B!A99","v":0},null,null,null,null,null,null,null,null,0,0]
[{"$f":"B5B!A100","v":0},null,null,null,null,null,null,null,null,0,0]
[{"$f":"B5B!A101","v":0},null,null,null,null,null,null,null,null,0,0]
[{"$f":"B5B!A102","v":0},null,null,null,null,null,null,null,null,0,0]
[{"$f":"B5B!A103","v":0},null,null,null,null,null,null,null,null,0,0]
[{"$f":"B5B!A104","v":0},null,null,null,null,null,null,null,null,0,0]
[{"$f":"B5B!A105","v":0},null,null,null,null,null,null,null,null,0,0]
[{"$f":"B5B!A106","v":0},null,null,null,null,null,null,null,null,0,0]
[{"$f":"B5B!A107","v":"Vote 10 - Waste Water Management"},null,{"$f":"SUM(C277:C286)","v":5664654.4500000002},0,0,0,0,0,800000,800000,6464654.4500000002,{"$f":"SUM(L277:L286)","v":19013657},{"$f":"SUM(M277:M286)","v":17294945}]
[{"$f":"B5B!A108","v":"10,1 - Public Toilets"},null,5664654.4500000002,null,null,null,null,null,800000,800000,6464654.4500000002,19013657,17294945]
[{"$f":"B5B!A109","v":0},null,null,null,null,null,null,null,null,0,0]
[{"$f":"B5B!A110","v":0},null,null,null,null,null,null,null,null,0,0]
[{"$f":"B5B!A111","v":0},null,null,null,null,null,null,null,null,0,0]
[{"$f":"B5B!A112","v":0},null,null,null,null,null,null,null,null,0,0]
[{"$f":"B5B!A113","v":0},null,null,null,null,null,null,null,null,0,0]
[{"$f":"B5B!A114","v":0},null,null,null,null,null,null,null,null,0,0]
[{"$f":"B5B!A115","v":0},null,null,null,null,null,null,null,null,0,0]
[{"$f":"B5B!A116","v":0},null,null,null,null,null,null,null,null,0,0]
[{"$f":"B5B!A117","v":0},null,null,null,null,null,null,null,null,0,0]
[{"$f":"B5B!A118","v":"Vote 11 - Waste Management"},null,{"$f":"SUM(C288:C297)","v":6140000},0,0,0,0,0,-1000000,-1000000,5140000,{"$f":"SUM(L288:L297)","v":3700000},{"$f":"SUM(M288:M297)","v":0}]
[{"$f":"B5B!A119","v":"11,1 - Solid Waste Removal"},null,6140000,null,null,null,null,null,-1000000,-1000000,5140000,3700000,0]
[{"$f":"B5B!A120","v":0},null,null,null,null,null,null,null,null,0,0]
[{"$f":"B5B!A121","v":0},null,null,null,null,null,null,null,null,0,0]
[{"$f":"B5B!A122","v":0},null,null,null,null,null,null,null,null,0,0]
[{"$f":"B5B!A123","v":0},null,null,null,null,null,null,null,null,0,0]
[{"$f":"B5B!A124","v":0},null,null,null,null,null,null,null,null,0,0]
[{"$f":"B5B!A125","v":0},null,null,null,null,null,null,null,null,0,0]
[{"$f":"B5B!A126","v":0},null,null,null,null,null,null,null,null,0,0]
[{"$f":"B5B!A127","v":0},null,null,null,null,null,null,null,null,0,0]
[{"$f":"B5B!A128","v":0},null,null,null,null,null,null,null,null,0,0]
[{"$f":"B5B!A129","v":"Vote 12 - [NAME OF VOTE 12]"},null,{"$f":"SUM(C299:C308)","v":0},0,0,0,0,0,0,0,0,{"$f":"SUM(L299:L308)","v":0},{"$f":"SUM(M299:M308)","v":0}]
[{"$f":"B5B!A130","v":"12.1 - [Name of sub-vote]"},null,null,null,null,null,null,null,null,0,0]
[{"$f":"B5B!A131","v":0},null,null,null,null,null,null,null,null,0,0]
[{"$f":"B5B!A132","v":0},null,null,null,null,null,null,null,null,0,0]
[{"$f":"B5B!A133","v":0},null,null,null,null,null,null,null,null,0,0]
[{"$f":"B5B!A134","v":0},null,null,null,null,null,null,null,null,0,0]
[{"$f":"B5B!A135","v":0},null,null,null,null,null,null,null,null,0,0]
[{"$f":"B5B!A136","v":0},null,null,null,null,null,null,null,null,{"$f":"SUM(E305:I305)","v":0},{"$f":"IF(D305=0,C305+J305,D305+J305)","v":0}]
[{"$f":"B5B!A137","v":0},null,null,null,null,null,null,null,null,0,0]
[{"$f":"B5B!A138","v":0},null,null,null,null,null,null,null,null,0,0]
[{"$f":"B5B!A139","v":0},null,null,null,null,null,null,null,null,0,0]
[{"$f":"B5B!A140","v":"Vote 13 - [NAME OF VOTE 13]"},null,{"$f":"SUM(C310:C319)","v":0},0,0,0,0,0,0,0,0,{"$f":"SUM(L310:L319)","v":0},{"$f":"SUM(M310:M319)","v":0}]
[{"$f":"B5B!A141","v":"13.1 - [Name of sub-vote]"},null,null,null,null,null,null,null,null,0,0]
[{"$f":"B5B!A142","v":0},null,null,null,null,null,null,null,null,0,0]
[{"$f":"B5B!A143","v":0},null,null,null,null,null,null,null,null,0,0]
[{"$f":"B5B!A144","v":0},null,null,null,null,null,null,null,null,0,0]
[{"$f":"B5B!A145","v":0},null,null,null,null,null,null,null,null,0,0]
[{"$f":"B5B!A146","v":0},null,null,null,null,null,null,null,null,0,0]
[{"$f":"B5B!A147","v":0},null,null,null,null,null,null,null,null,0,0]
[{"$f":"B5B!A148","v":0},null,null,null,null,null,null,null,null,0,0]
[{"$f":"B5B!A149","v":0},null,null,null,null,null,null,null,null,0,0]
[{"$f":"B5B!A150","v":0},null,null,null,null,null,null,null,null,0,0]
[{"$f":"B5B!A151","v":"Vote 14 - [NAME OF VOTE 14]"},null,{"$f":"SUM(C321:C330)","v":0},0,0,0,0,0,0,0,0,{"$f":"SUM(L321:L330)","v":0},{"$f":"SUM(M321:M330)","v":0}]
[{"$f":"B5B!A152","v":"14.1 - [Name of sub-vote]"},null,null,null,null,null,null,null,null,0,0]
[{"$f":"B5B!A153","v":0},null,null,null,null,null,null,null,null,0,0]
[{"$f":"B5B!A154","v":0},null,null,null,null,null,null,null,null,0,0]
[{"$f":"B5B!A155","v":0},null,null,null,null,null,null,null,null,0,0]
[{"$f":"B5B!A156","v":0},null,null,null,null,null,null,null,null,0,0]
[{"$f":"B5B!A157","v":0},null,null,null,null,null,null,null,null,0,0]
[{"$f":"B5B!A158","v":0},null,null,null,null,null,null,null,null,0,0]
[{"$f":"B5B!A159","v":0},null,null,null,null,null,null,null,null,0,0]
[{"$f":"B5B!A160","v":0},null,null,null,null,null,null,null,null,0,0]
[{"$f":"B5B!A161","v":0},null,null,null,null,null,null,null,null,0,0]
[{"$f":"B5B!A162","v":"Vote 15 - [NAME OF VOTE 15]"},null,{"$f":"SUM(C332:C341)","v":0},0,0,0,0,0,0,0,0,{"$f":"SUM(L332:L341)","v":0},{"$f":"SUM(M332:M341)","v":0}]
[{"$f":"B5B!A163","v":"15.1 - [Name of sub-vote]"},null,null,null,null,null,null,null,null,0,0]
[{"$f":"B5B!A164","v":0},null,null,null,null,null,null,null,null,0,0]
[{"$f":"B5B!A165","v":0},null,null,null,null,null,null,null,null,0,0]
[{"$f":"B5B!A166","v":0},null,null,null,null,null,null,null,null,0,0]
[{"$f":"B5B!A167","v":0},null,null,null,null,null,null,null,null,0,0]
[{"$f":"B5B!A168","v":0},null,null,null,null,null,null,null,null,0,0]
[{"$f":"B5B!A169","v":0},null,null,null,null,null,null,null,null,0,0]
[{"$f":"B5B!A170","v":0},null,null,null,null,null,null,null,null,0,0]
[{"$f":"B5B!A171","v":0},null,null,null,null,null,null,null,null,0,0]
[{"$f":"B5B!A172","v":0},null,null,null,null,null,null,null,null,0,0]
["Capital single-year expenditure sub-total",null,{"$f":"C177+C188+C199+C210+C221+C232+C243+C254+C265+C287+C298+C309+C320+C331+C276","v":55284072.310000002},{"$f":"D177+D188+D199+D210+D221+D232+D243+D254+D265+D287+D298+D309+D320+D331+D276","v":0},0,0,0,0,9130615,9130615,64414687.310000002,{"$f":"L177+L188+L199+L210+L221+L232+L243+L254+L265+L287+L298+L309+L320+L331+L276","v":60993657},{"$f":"M177+M188+M199+M210+M221+M232+M243+M254+M265+M287+M298+M309+M320+M331+M276","v":54806037}]
["Total Capital Expenditure",null,{"$f":"C342+C173","v":179277319.12},{"$f":"D342+D173","v":0},0,0,0,0,-5615913,{"$f":"SUM(E343:I343)","v":-5615913},{"$f":"IF(D343=0,C343+J343,D343+J343)","v":173661406.12},{"$f":"L342+L173","v":174388883},{"$f":"M342+M173","v":192009876}]
[]
[]
[{"$f":"head27a","v":"References"}]
["1. Insert 'Vote'; e.g. Department, if different to standard structure"]
["2. Must reconcile to Financial Performance ('Revenue and Expenditure by Standard Classification' and 'Revenue and Expenditure')"]
["3. Assign share in 'associate' to relevant Vote"]

{"sheet":"B6-FinPos","index":14,"n_rows":63,"n_cols":13,"rows_kept":63,"cut":false,"hidden":false,"merged":[[1,2,1,10],[1,0,3,0],[1,1,3,1],[60,0,60,12],[56,0,56,12],[58,0,58,12],[54,0,54,12],[55,0,55,12],[53,0,53,12]]}
[{"$f":"muni&\" - \"&_ADJ6&\" - \"&Date","v":"LIM332 Greater Letaba - Table B6 Adjustments Budget Financial Position - 27 February 2019"}]
[{"$f":"desc","v":"Description"},{"$f":"head27","v":"Ref"},{"$f":"Head2","v":"Budget Year 2018/19"},null,null,null,null,null,null,null,null,{"$f":"Head10","v":"Budget Year +1 2019/20"},{"$f":"Head11","v":"Budget Year +2 2020/21"}]
[null,null,{"$f":"Head6","v":"Original Budget"},{"$f":"Head54","v":"Prior Adjusted"},{"$f":"Head51","v":"Accum. Funds"},{"$f":"Head52","v":"Multi-year capital"},{"$f":"Head53","v":"Unfore. Unavoid."},{"$f":"Head55","v":"Nat. or Prov. Govt"},{"$f":"Head50","v":"Other Adjusts."},{"$f":"Head56","v":"Total Adjusts."},{"$f":"Head7","v":"Adjusted Budget"},{"$f":"Head7","v":"Adjusted Budget"},{"$f":"Head7","v":"Adjusted Budget"}]
[null,null,null,3,4,5,6,7,8,9,10]
["R thousands",null,"A","A1","B","C","D","E","F","G","H"]
["ASSETS"]
["Current assets"]
["Cash",null,1200000,null,null,null,null,null,-695000,{"$f":"SUM(E8:I8)","v":-695000},{"$f":"IF(D8=0,C8+J8,D8+J8)","v":505000},1895000,2115000]
["Call investment deposits",1,{"$f":"'SB2'!C10","v":28521281.529999997},{"$f":"'SB2'!D10","v":0},{"$f":"'SB2'!E10","v":0},{"$f":"'SB2'!F10","v":0},{"$f":"'SB2'!G10","v":0},{"$f":"'SB2'!H10","v":0},{"$f":"'SB2'!I10","v":-25000000},-25000000,3521281.5299999975,{"$f":"'SB2'!L10","v":5131281.5300000012},{"$f":"'SB2'!M10","v":5413502.0141500011}]
["Consumer debtors",1,{"$f":"'SB2'!C14","v":6900000},{"$f":"'SB2'!D14","v":0},{"$f":"'SB2'!E14","v":0},{"$f":"'SB2'!F14","v":0},{"$f":"'SB2'!G14","v":0},{"$f":"'SB2'!H14","v":0},{"$f":"'SB2'!I14","v":0},0,6900000,{"$f":"'SB2'!L14","v":7000000},{"$f":"'SB2'!M14","v":7000000}]
["Other debtors",null,44274458.958912,null,null,null,null,null,0,0,44274458.958912,46665279.742693253,49231870.12854138]
["Current portion of long-term receivables",null,12078140.607000001,null,null,null,null,null,0,0,12078140.607000001,12730360.199778002,13430530.010765791]
["Inventory",null,3215395.2366899997,null,null,null,null,null,0,0,3215395.2366899997,3389026.5794712598,3575423.0413421793]
["Total current assets",null,{"$f":"SUM(C8:C13)","v":96189276.332602009},0,0,0,0,0,-25695000,-25695000,70494276.332602009,76810948.051942512,80766325.194799349]
[]
["Non current assets"]
["Long-term receivables",null,0,null,null,null,null,null,0,{"$f":"SUM(E17:I17)","v":0},{"$f":"IF(D17=0,C17+J17,D17+J17)","v":0},0,0]
["Investments",null,0,null,null,null,null,null,0,0,0,0,0]
["Investment property",null,249045,null,null,null,null,null,0,0,249045,249045,249045]
["Investment in Associate",null,0,null,null,null,null,null,0,0,0,0,0]
["Property, plant and equipment",1,{"$f":"'SB2'!C24","v":853915938.60473883},{"$f":"'SB2'!D24","v":0},{"$f":"'SB2'!E24","v":0},{"$f":"'SB2'!F24","v":0},{"$f":"'SB2'!G24","v":0},{"$f":"'SB2'!H24","v":0},{"$f":"'SB2'!I24","v":-5305913},-5305913,848610025.60473883,{"$f":"'SB2'!L24","v":1004098927.5452082},{"$f":"'SB2'!M24","v":1010395706.9540744}]
["Agricultural",null,0,null,null,null,null,null,0,0,0,0,0]
["Biological",null,0,null,null,null,null,null,0,0,0,0,0]
["Intangible",null,208103,null,null,null,null,null,0,0,208103,208103,208103]
["Other non-current assets",null,548500,null,null,null,null,null,0,0,548500,548500,548500]
["Total non current assets",null,{"$f":"SUM(C17:C25)","v":854921586.60473883},0,0,0,0,0,-5305913,-5305913,849615673.60473883,1005104575.5452082,1011401354.9540744]
["TOTAL ASSETS",null,{"$f":"C14+C26","v":951110862.93734086},0,0,0,0,0,-31000913,-31000913,920109949.93734086,1081915523.5971508,1092167680.1488738]
[]
["LIABILITIES"]
["Current liabilities"]
["Bank overdraft",null,0,null,null,null,null,null,0,{"$f":"SUM(E31:I31)","v":0},{"$f":"IF(D31=0,C31+J31,D31+J31)","v":0},0,0]
["Borrowing",null,{"$f":"'SB2'!C30","v":0},{"$f":"'SB2'!D30","v":0},{"$f":"'SB2'!E30","v":0},{"$f":"'SB2'!F30","v":0},{"$f":"'SB2'!G30","v":0},{"$f":"'SB2'!H30","v":0},{"$f":"'SB2'!I30","v":0},{"$f":"SUM(E32:I32)","v":0},{"$f":"IF(D32=0,C32+J32,D32+J32)","v":0},{"$f":"'SB2'!L30","v":0},{"$f":"'SB2'!M30","v":0}]
["Consumer deposits",null,369922.05900000001,null,null,null,null,null,0,{"$f":"SUM(E33:I33)","v":0},{"$f":"IF(D33=0,C33+J33,D33+J33)","v":369922.05900000001},389897.850186,411342.23194622999]
["Trade and other payables",null,{"$f":"'SB2'!C35","v":35693282},{"$f":"'SB2'!D35","v":0},{"$f":"'SB2'!E35","v":0},{"$f":"'SB2'!F35","v":0},{"$f":"'SB2'!G35","v":0},{"$f":"'SB2'!H35","v":0},{"$f":"'SB2'!I35","v":0},{"$f":"SUM(E34:I34)","v":0},{"$f":"IF(D34=0,C34+J34,D34+J34)","v":35693282},{"$f":"'SB2'!L35","v":35000000},{"$f":"'SB2'!M35","v":36100000}]
["Provisions",null,0,0,0,0,0,0,0,{"$f":"SUM(E35:I35)","v":0},{"$f":"IF(D35=0,C35+J35,D35+J35)","v":0},0,0]
["Total current liabilities",null,{"$f":"SUM(C31:C35)","v":36063204.059},0,0,0,0,0,0,0,36063204.059,35389897.850185998,36511342.23194623]
[]
["Non current liabilities"]
["Borrowing",1,{"$f":"'SB2'!C39","v":0},{"$f":"'SB2'!D39","v":0},{"$f":"'SB2'!E39","v":0},{"$f":"'SB2'!F39","v":0},{"$f":"'SB2'!G39","v":0},{"$f":"'SB2'!H39","v":0},{"$f":"'SB2'!I39","v":0},{"$f":"SUM(E39:I39)","v":0},{"$f":"IF(D39=0,C39+J39,D39+J39)","v":0},{"$f":"'SB2'!L39","v":0},{"$f":"'SB2'!M39","v":0}]
["Provisions",1,{"$f":"'SB2'!C45","v":14744449.647768002},{"$f":"'SB2'!D45","v":0},{"$f":"'SB2'!E45","v":0},{"$f":"'SB2'!F45","v":0},{"$f":"'SB2'!G45","v":0},{"$f":"'SB2'!H45","v":0},{"$f":"'SB2'!I45","v":0},{"$f":"SUM(E40:I40)","v":0},{"$f":"IF(D40=0,C40+J40,D40+J40)","v":14744449.647768002},{"$f":"'SB2'!L45","v":15410142.728747476},{"$f":"'SB2'!M45","v":16124776.578828588}]
["Total non current liabilities",null,{"$f":"SUM(C39:C40)","v":14744449.647768002},0,0,0,0,0,0,0,14744449.647768002,15410142.728747476,16124776.578828588]
["TOTAL LIABILITIES",null,{"$f":"C36+C41","v":50807653.706768006},0,0,0,0,0,0,0,50807653.706768006,50800040.578933477,52636118.810774818]
[]
["NET ASSETS",2,{"$f":"C27-C42","v":900303209.23057282},0,0,0,0,0,-31000913,-31000913,869302296.23057282,1031115483.0182173,1039531561.338099]
[]
["COMMUNITY WEALTH/EQUITY"]
["Accumulated Surplus/(Deficit)",null,{"$f":"'SB2'!C54","v":900303209.23057282},{"$f":"'SB2'!D54","v":0},{"$f":"'SB2'!E54","v":0},{"$f":"'SB2'!F54","v":0},{"$f":"'SB2'!G54","v":0},{"$f":"'SB2'!H54","v":0},{"$f":"'SB2'!I54","v":-31000913},{"$f":"SUM(E47:I47)","v":-31000913},{"$f":"IF(D47=0,C47+J47,D47+J47)","v":869302296.23057282},{"$f":"'SB2'!L54","v":1031115483.0182173},{"$f":"'SB2'!M54","v":1039531561.338099}]
["Reserves",null,{"$f":"'SB2'!C61","v":0},{"$f":"'SB2'!D61","v":0},{"$f":"'SB2'!E61","v":0},{"$f":"'SB2'!F61","v":0},{"$f":"'SB2'!G61","v":0},{"$f":"'SB2'!H61","v":0},{"$f":"'SB2'!I61","v":0},{"$f":"SUM(E48:I48)","v":0},{"$f":"IF(D48=0,C48+J48,D48+J48)","v":0},{"$f":"'SB2'!L61","v":0},{"$f":"'SB2'!M61","v":0}]
["Minorities' interests",null,0,0,0,0,0,0,0,{"$f":"SUM(E49:I49)","v":0},{"$f":"IF(D49=0,C49+J49,D49+J49)","v":0},0,0]
["TOTAL COMMUNITY WEALTH/EQUITY",null,{"$f":"SUM(C47:C49)","v":900303209.23057282},{"$f":"SUM(D47:D49)","v":0},0,0,0,0,-31000913,-31000913,869302296.23057282,1031115483.0182173,1039531561.338099]
[{"$f":"head27a","v":"References"}]
["1. Detail to be provided in Table SA3"]
["2. Net assets must balance with Total Community Wealth/Equity"]
["3. Only complete if a previous adjusted budget has been approved in the same financial year. Reflect most recent adjusted budget."]
["4. Additional cash-backed accumulated funds/unspent funds (MFMA section 18(1)(b) and section 28(2)(e)) identified after the Original Budget approved and after annual financial statements audited (note: only where underspending could not reasonably have been foreseen)"]
["5. Increases of funds approved under MFMA section 31"]
["6. Adjustments approved in accordance with MFMA section 29 "]
["7. Adjustments to transfers from National or Provincial Government"]
["8. Adjusts. = 'Other' Adjustments proposed to be approved; including revenue under-collection (MFMA section 28(2)(a)); additional revenue appropriation on existing programmes (section 28(2))(b); projected savings (section 28(2)(d)); error correction (section 28(2)(f))"]
["9. G = B + C + D + E + F"]
["10. Adjusted Budget H = (A or A1/2 etc) + G"]
[]
["check balance",null,{"$f":"C44-C50","v":0},0,0,0,0,0,0,0,0,0,0]

{"sheet":"B7-CFlow","index":15,"n_rows":53,"n_cols":13,"rows_kept":53,"cut":false,"hidden":false,"merged":[[52,0,52,12],[46,0,46,12],[50,0,50,12],[1,0,3,0],[1,1,3,1],[1,2,1,10],[45,0,45,12],[47,0,47,12],[48,0,48,12]]}
[{"$f":"muni&\" - \"&_ADJ7&\" - \"&Date","v":"LIM332 Greater Letaba - Table B7 Adjustments Budget Cash Flows - 27 February 2019"}]
[{"$f":"desc","v":"Description"},{"$f":"head27","v":"Ref"},{"$f":"Head2","v":"Budget Year 2018/19"},null,null,null,null,null,null,null,null,{"$f":"Head10","v":"Budget Year +1 2019/20"},{"$f":"Head11","v":"Budget Year +2 2020/21"}]
[null,null,{"$f":"Head6","v":"Original Budget"},{"$f":"Head54","v":"Prior Adjusted"},{"$f":"Head51","v":"Accum. Funds"},{"$f":"Head52","v":"Multi-year capital"},{"$f":"Head53","v":"Unfore. Unavoid."},{"$f":"Head55","v":"Nat. or Prov. Govt"},{"$f":"Head50","v":"Other Adjusts."},{"$f":"Head56","v":"Total Adjusts."},{"$f":"Head7","v":"Adjusted Budget"},{"$f":"Head7","v":"Adjusted Budget"},{"$f":"Head7","v":"Adjusted Budget"}]
[null,null,null,3,4,5,6,7,8,9,10]
["R thousands",null,"A","A1","B","C","D","E","F","G","H"]
["CASH FLOW FROM OPERATING ACTIVITIES"]
["Receipts"]
["Property rates",null,6453196.5420000004,null,null,null,null,null,3665000,{"$f":"SUM(E8:I8)","v":3665000},{"$f":"IF(D8=0,C8+J8,D8+J8)","v":10118196.541999999},{"$f":"16894401*0.6","v":10136640.6},{"$f":"17992537*0.6","v":10795522.199999999}]
["Service charges",null,13879352.660000002,null,null,null,null,null,10640000,{"$f":"SUM(E9:I9)","v":10640000},{"$f":"IF(D9=0,C9+J9,D9+J9)","v":24519352.660000004},{"$f":"19142000+4629000","v":23771000},{"$f":"20386000+4929000","v":25315000}]
["Other revenue",null,28562039.651999999,null,null,null,null,null,28580000,28580000,57142039.651999995,{"$f":"1019000+767000+16912000+2317000+12800000","v":33815000},{"$f":"1085000+817000+18011000+2468000+13632000","v":36013000}]
["Government - operating",1,248358000,null,null,null,null,null,0,0,248358000,274109000,297262000]
["Government - capital",1,62443000,null,null,null,null,null,0,0,62443000,70764900,73538344]
["Interest",null,9584354.102,null,null,null,null,null,8513000,8513000,18097354.101999998,{"$f":"2888000+14678000","v":17566000},{"$f":"3076000+15632000","v":18708000}]
["Dividends",null,0,null,null,null,null,null,0,0,0,0,0]
["Payments"]
["Suppliers and employees",null,-217786402.5,null,null,null,null,null,-49779000,{"$f":"SUM(E16:I16)","v":-49779000},{"$f":"IF(D16=0,C16+J16,D16+J16)","v":-267565402.5},{"$f":"-272898908*0.9","v":-245609017.20000002},{"$f":"-290291664*0.9","v":-261262497.59999999}]
["Finance charges",null,0,null,null,null,null,null,0,{"$f":"SUM(E17:I17)","v":0},{"$f":"IF(D17=0,C17+J17,D17+J17)","v":0},0,0]
["Transfers and Grants",1,0,null,null,null,null,null,0,{"$f":"SUM(E18:I18)","v":0},{"$f":"IF(D18=0,C18+J18,D18+J18)","v":0},0,0]
["NET CASH FROM/(USED) OPERATING ACTIVITIES",null,{"$f":"SUM(C8:C14)+SUM(C16:C18)","v":151493540.45599997},{"$f":"SUM(D8:D14)+SUM(D16:D18)","v":0},0,0,0,0,1619000,{"$f":"SUM(J8:J18)","v":1619000},{"$f":"SUM(K8:K18)","v":153112540.45599997},{"$f":"SUM(L8:L14)+SUM(L16:L18)","v":184553523.40000001},{"$f":"SUM(M8:M14)+SUM(M16:M18)","v":200369368.59999999}]
[]
["CASH FLOWS FROM INVESTING ACTIVITIES"]
["Receipts"]
["Proceeds on disposal of PPE",null,577000,null,null,null,null,null,0,{"$f":"SUM(E23:I23)","v":0},{"$f":"IF(D23=0,C23+J23,D23+J23)","v":577000},608158,641607]
["Decrease (Increase) in non-current debtors",null,0,null,null,null,null,null,0,{"$f":"SUM(E24:I24)","v":0},{"$f":"IF(D24=0,C24+J24,D24+J24)","v":0},0,0]
["Decrease (increase) other non-current receivables",null,0,null,null,null,null,null,0,{"$f":"SUM(E25:I25)","v":0},{"$f":"IF(D25=0,C25+J25,D25+J25)","v":0},0,0]
["Decrease (increase) in non-current investments",null,0,null,null,null,null,null,0,{"$f":"SUM(E26:I26)","v":0},{"$f":"IF(D26=0,C26+J26,D26+J26)","v":0},0,0]
["Payments"]
["Capital assets",null,-145091397.96900001,null,null,null,null,null,{"$f":"-18748000+505000","v":-18243000},{"$f":"SUM(E28:I28)","v":-18243000},{"$f":"IF(D28=0,C28+J28,D28+J28)","v":-163334397.96900001},{"$f":"-186136900+2585000","v":-183551900},{"$f":"-171056344-30000000+328000","v":-200728344}]
["NET CASH FROM/(USED) INVESTING ACTIVITIES",null,{"$f":"SUM(C23:C26)+C28","v":-144514397.96900001},{"$f":"SUM(D23:D26)+D28","v":0},0,0,0,0,-18243000,{"$f":"SUM(J23:J28)","v":-18243000},{"$f":"SUM(K23:K28)","v":-162757397.96900001},{"$f":"SUM(L23:L26)+L28","v":-182943742},{"$f":"SUM(M23:M26)+M28","v":-200086737}]
[]
["CASH FLOWS FROM FINANCING ACTIVITIES"]
["Receipts"]
["Short term loans",null,null,null,null,null,null,null,null,{"$f":"SUM(E33:I33)","v":0},{"$f":"IF(D33=0,C33+J33,D33+J33)","v":0}]
["Borrowing long term/refinancing",null,null,null,null,null,null,null,null,{"$f":"SUM(E34:I34)","v":0},{"$f":"IF(D34=0,C34+J34,D34+J34)","v":0}]
["Increase (decrease) in consumer deposits",null,null,null,null,null,null,null,null,{"$f":"SUM(E35:I35)","v":0},{"$f":"IF(D35=0,C35+J35,D35+J35)","v":0}]
["Payments"]
["Repayment of borrowing",null,null,null,null,null,null,null,null,{"$f":"SUM(E37:I37)","v":0},{"$f":"IF(D37=0,C37+J37,D37+J37)","v":0}]
["NET CASH FROM/(USED) FINANCING ACTIVITIES",null,{"$f":"SUM(C33:C35)+C37","v":0},{"$f":"SUM(D33:D35)+D37","v":0},0,0,0,0,0,{"$f":"SUM(J33:J37)","v":0},{"$f":"SUM(K33:K37)","v":0},{"$f":"SUM(L33:L35)+L37","v":0},{"$f":"SUM(M33:M35)+M37","v":0}]
[]
["NET INCREASE/ (DECREASE) IN CASH HELD",null,{"$f":"C19+C29+C38","v":6979142.4869999588},{"$f":"D19+D29+D38","v":0},0,0,0,0,-16624000,-16624000,-9644857.5130000412,1609781.400000006,282631.59999999404]
["Cash/cash equivalents at the year begin:",2,13671000,null,null,null,null,null,0,{"$f":"SUM(E41:I41)","v":0},{"$f":"IF(D41=0,C41+J41,D41+J41)","v":13671000},4026000,5636000]
["Cash/cash equivalents at the year end:",2,{"$f":"C40+C41","v":20650142.486999959},{"$f":"D40+D41","v":0},0,0,0,0,-16624000,-16624000,{"$f":"K40+K41","v":4026142.4869999588},{"$f":"L40+L41","v":5635781.400000006},{"$f":"M40+M41","v":5918631.599999994}]
[{"$f":"head27a","v":"References"}]
["1. Local/District municipalities to include transfers from/to District/Local Municipalities"]
["2. Cash equivalents includes investments with maturities of 3 months or less"]
["3. Only complete if a previous adjusted budget has been approved in the same financial year. Reflect most recent adjusted budget."]
["4. Additional cash-backed accumulated funds/unspent funds (MFMA section 18(1)(b) and section 28(2)(e)) identified after the Original Budget approved and after annual financial statements audited (note: only where underspending could not reasonably have been foreseen)"]
["5. Increases of funds approved under MFMA section 31"]
["6. Adjustments approved in accordance with MFMA section 29 "]
["7. Adjustments to transfers from National or Provincial Government"]
["8. Adjusts. = 'Other' Adjustments proposed to be approved; including revenue under-collection (MFMA section 28(2)(a)); additional revenue appropriation on existing programmes (section 28(2))(b); projected savings (section 28(2)(d)); error correction (section 28(2)(f))"]
["9. G = B + C + D + E + F"]
["10. Adjusted Budget H = (A or A1/2 etc) + G"]

{"sheet":"B8-ResRecon","index":16,"n_rows":57,"n_cols":13,"rows_kept":57,"cut":false,"hidden":false,"merged":[[1,1,3,1],[1,0,3,0],[1,2,1,10]]}
[{"$f":"muni&\" - \"&_ADJ8&\" - \"&Date","v":"LIM332 Greater Letaba - Table B8 Cash backed reserves/accumulated surplus reconciliation - 27 February 2019"}]
[{"$f":"desc","v":"Description"},{"$f":"head27","v":"Ref"},{"$f":"Head2","v":"Budget Year 2018/19"},null,null,null,null,null,null,null,null,{"$f":"Head10","v":"Budget Year +1 2019/20"},{"$f":"Head11","v":"Budget Year +2 2020/21"}]
[null,null,{"$f":"Head6","v":"Original Budget"},{"$f":"Head54","v":"Prior Adjusted"},{"$f":"Head51","v":"Accum. Funds"},{"$f":"Head52","v":"Multi-year capital"},{"$f":"Head53","v":"Unfore. Unavoid."},{"$f":"Head55","v":"Nat. or Prov. Govt"},{"$f":"Head50","v":"Other Adjusts."},{"$f":"Head56","v":"Total Adjusts."},{"$f":"Head7","v":"Adjusted Budget"},{"$f":"Head7","v":"Adjusted Budget"},{"$f":"Head7","v":"Adjusted Budget"}]
[null,null,null,3,4,5,6,7,8,9,10]
["R thousands",null,"A","A1","B","C","D","E","F","G","H"]
["Cash and investments available"]
["Cash/cash equivalents at the year end",1,{"$f":"'B7-CFlow'!C42","v":20650142.486999959},{"$f":"'B7-CFlow'!D42","v":0},{"$f":"'B7-CFlow'!E42","v":0},{"$f":"'B7-CFlow'!F42","v":0},{"$f":"'B7-CFlow'!G42","v":0},{"$f":"'B7-CFlow'!H42","v":0},{"$f":"'B7-CFlow'!I42","v":-16624000},{"$f":"SUM(E7:I7)","v":-16624000},{"$f":"IF(D7=0,C7+J7,D7+J7)","v":4026142.4869999588},{"$f":"'B7-CFlow'!L42","v":5635781.400000006},{"$f":"'B7-CFlow'!M42","v":5918631.599999994}]
["Other current investments  > 90 days",null,{"$f":"'B6-FinPos'!C8+'B6-FinPos'!C9-'B6-FinPos'!C31-'B8-ResRecon'!C7","v":9071139.0430000387},{"$f":"'B6-FinPos'!D8+'B6-FinPos'!D9-'B6-FinPos'!D31-'B8-ResRecon'!D7","v":0},{"$f":"'B6-FinPos'!E8+'B6-FinPos'!E9-'B6-FinPos'!E31-'B8-ResRecon'!E7","v":0},{"$f":"'B6-FinPos'!F8+'B6-FinPos'!F9-'B6-FinPos'!F31-'B8-ResRecon'!F7","v":0},{"$f":"'B6-FinPos'!G8+'B6-FinPos'!G9-'B6-FinPos'!G31-'B8-ResRecon'!G7","v":0},{"$f":"'B6-FinPos'!H8+'B6-FinPos'!H9-'B6-FinPos'!H31-'B8-ResRecon'!H7","v":0},{"$f":"'B6-FinPos'!I8+'B6-FinPos'!I9-'B6-FinPos'!I31-'B8-ResRecon'!I7","v":-9071000},{"$f":"SUM(E8:I8)","v":-9071000},{"$f":"IF(D8=0,C8+J8,D8+J8)","v":139.04300003871322},{"$f":"'B6-FinPos'!L8+'B6-FinPos'!L9-'B6-FinPos'!L31-'B8-ResRecon'!L7","v":1390500.1299999952},{"$f":"'B6-FinPos'!M8+'B6-FinPos'!M9-'B6-FinPos'!M31-'B8-ResRecon'!M7","v":1609870.4141500071}]
["Non current assets - Investments",1,{"$f":"'B6-FinPos'!C18","v":0},{"$f":"'B6-FinPos'!D18","v":0},{"$f":"'B6-FinPos'!E18","v":0},{"$f":"'B6-FinPos'!F18","v":0},{"$f":"'B6-FinPos'!G18","v":0},{"$f":"'B6-FinPos'!H18","v":0},{"$f":"'B6-FinPos'!I18","v":0},{"$f":"SUM(E9:I9)","v":0},{"$f":"IF(D9=0,C9+J9,D9+J9)","v":0},{"$f":"'B6-FinPos'!L18","v":0},{"$f":"'B6-FinPos'!M18","v":0}]
["Cash and investments available:",null,{"$f":"SUM(C7:C9)","v":29721281.529999997},0,0,0,0,0,-25695000,-25695000,4026281.5299999975,7026281.5300000012,7528502.0141500011]
[]
["Applications of cash and investments"]
["Unspent conditional transfers",null,{"$f":"'SB2'!C33","v":0},{"$f":"'SB2'!D33","v":0},{"$f":"'SB2'!E33","v":0},{"$f":"'SB2'!F33","v":0},{"$f":"'SB2'!G33","v":0},{"$f":"'SB2'!H33","v":0},{"$f":"'SB2'!I33","v":0},{"$f":"SUM(E13:I13)","v":0},{"$f":"IF(D13=0,C13+J13,D13+J13)","v":0},{"$f":"'SB2'!L33","v":0},{"$f":"'SB2'!M33","v":0}]
["Unspent borrowing",null,0,null,null,null,null,null,0,0,{"$f":"IF(D14=0,C14+J14,D14+J14)","v":0},0,0]
["Statutory requirements",null,3025100,null,null,null,null,null,0,0,{"$f":"IF(D15=0,C15+J15,D15+J15)","v":3025100},3025100,3025100]
["Other working capital requirements",2,{"$f":"-C40","v":6867340},{"$f":"-D40","v":0},null,null,null,null,{"$f":"IF(D16=0,(K16-C16)-SUM(E16:H16),(K16-D16)-SUM(E16:H16))","v":-6427857},-6427857,{"$f":"-K40","v":439483},{"$f":"-L40","v":1490301},{"$f":"-M40","v":988200}]
["Other provisions",null,14744449.647768002,null,null,null,null,null,0,0,{"$f":"IF(D17=0,C17+J17,D17+J17)","v":14744449.647768002},14744449.647768002,14744449.647768002]
["Long term investments committed",null,{"$f":"C50","v":0},{"$f":"D50","v":0},null,null,null,null,{"$f":"IF(D18=0,(K18-C18)-SUM(E18:H18),(K18-D18)-SUM(E18:H18))","v":0},0,{"$f":"K50","v":0},{"$f":"L50","v":0},{"$f":"M50","v":0}]
["Reserves to be backed by cash/investments",null,{"$f":"C57","v":0},{"$f":"D57","v":0},null,null,null,null,{"$f":"IF(D19=0,(K19-C19)-SUM(E19:H19),(K19-D19)-SUM(E19:H19))","v":0},0,{"$f":"K57","v":0},{"$f":"L57","v":0},{"$f":"M57","v":0}]
["Total Application of cash and investments:",null,{"$f":"SUM(C13:C19)","v":24636889.647768002},0,0,0,0,0,-6427857,-6427857,18209032.647768002,19259850.647768002,18757749.647768002]
["Surplus(shortfall)",null,{"$f":"C10-C20","v":5084391.8822319955},0,0,0,0,0,-19267143,-19267143,-14182751.117768005,-12233569.117768001,-11229247.633618001]
[{"$f":"head27a","v":"References"}]
["1. Must reconcile with the Adjustments Budget Cash Flow and Adjustements Budget Financial Position"]
["2. Council approval for policy required - include sufficient working capital (e.g. allowing for a % of current debtors > 90 days as uncollectable)"]
["3. Only complete if a previous adjusted budget has been approved in the same financial year. Reflect most recent adjusted budget."]
["4. Additional cash-backed accumulated funds/unspent funds (MFMA section 18(1)(b) and section 28(2)(e)) identified after the Original Budget approved and after annual financial statements audited (note: only where underspending could not reasonably have been foreseen)"]
["5. Increases of funds approved under MFMA section 31"]
["6. Adjustments approved in accordance with MFMA section 29 "]
["7. Adjustments to transfers from National or Provincial Government"]
["8. Adjusts. = 'Other' Adjustments proposed to be approved; including revenue under-collection (MFMA section 28(2)(a)); additional revenue appropriation on existing programmes (section 28(2))(b); projected savings (section 28(2)(d)); error correction (section 28(2)(f))"]
["9. G = B + C + D + E + F"]
["10. Adjusted Budget H = (A or A1/2 etc) + G"]
[]
[]
[]
[]
[{"$f":"A16","v":"Other working capital requirements"}]
["Debtors",null,{"$f":"IF(ISERROR(ROUND(C43*C44,0)),0,(ROUND(C43*C44,0)))","v":28825942},{"$f":"IF(ISERROR(ROUND(D43*D44,0)),0,(ROUND(D43*D44,0)))","v":0},null,null,null,null,null,null,{"$f":"IF(ISERROR(ROUND(K43*K44,0)),0,(ROUND(K43*K44,0)))","v":35253799},{"$f":"IF(ISERROR(ROUND(L43*L44,0)),0,(ROUND(L43*L44,0)))","v":33509699},{"$f":"IF(ISERROR(ROUND(M43*M44,0)),0,(ROUND(M43*M44,0)))","v":35111800}]
["Creditors due",null,{"$f":"'SB2'!C32","v":35693282},{"$f":"'SB2'!D32","v":0},null,null,null,null,null,null,{"$f":"'SB2'!K32","v":35693282},{"$f":"'SB2'!L32","v":35000000},{"$f":"'SB2'!M32","v":36100000}]
["Total",null,{"$f":"C38-C39","v":-6867340},{"$f":"D38-D39","v":0},null,null,null,null,null,null,{"$f":"K38-K39","v":-439483},{"$f":"L38-L39","v":-1490301},{"$f":"M38-M39","v":-988200}]
[]
["Debtors collection assumptions:"]
["Balance outstanding - debtors",null,{"$f":"'B6-FinPos'!C10+'B6-FinPos'!C11+'B6-FinPos'!C17","v":51174458.958912},{"$f":"'B6-FinPos'!D10+'B6-FinPos'!D11+'B6-FinPos'!D17","v":0},null,null,null,null,null,null,{"$f":"'B6-FinPos'!K10+'B6-FinPos'!K11+'B6-FinPos'!K17","v":51174458.958912},{"$f":"'B6-FinPos'!L10+'B6-FinPos'!L11+'B6-FinPos'!L17","v":53665279.742693253},{"$f":"'B6-FinPos'!M10+'B6-FinPos'!M11+'B6-FinPos'!M17","v":56231870.12854138}]
["Estimate of debtors collection rate",null,{"$f":"IF(ISERROR('SB6'!G10),0,('SB6'!G10))","v":0.56328766652640994},{"$f":"IF(ISERROR('SB6'!H10),0,('SB6'!H10))","v":0},null,null,null,null,null,null,{"$f":"IF(ISERROR('SB6'!I10),0,('SB6'!I10))","v":0.68889442494541442},{"$f":"IF(ISERROR('SB6'!J10),0,('SB6'!J10))","v":0.62442046022880271},{"$f":"IF(ISERROR('SB6'!K10),0,('SB6'!K10))","v":0.62441102613771882}]
[]
[{"$f":"A18","v":"Long term investments committed"}]
["(Insert description; eg sinking fund)"]
[]
[]
[null,null,{"$f":"SUM(C47:C49)","v":0},{"$f":"SUM(D47:D49)","v":0},null,null,null,null,null,null,{"$f":"SUM(K47:K49)","v":0},{"$f":"SUM(L47:L49)","v":0},{"$f":"SUM(M47:M49)","v":0}]
[]
[{"$f":"A19","v":"Reserves to be backed by cash/investments"}]
[{"$f":"'SB2'!A56","v":"Housing Development Fund"},null,{"$f":"'SB2'!C56","v":0},{"$f":"'SB2'!D56","v":0},null,null,null,null,null,null,{"$f":"'SB2'!K56","v":0},{"$f":"'SB2'!L56","v":0},{"$f":"'SB2'!M56","v":0}]
[{"$f":"'SB2'!A57","v":"Capital replacement"},null,{"$f":"'SB2'!C57","v":0},{"$f":"'SB2'!D57","v":0},null,null,null,null,null,null,{"$f":"'SB2'!K57","v":0},{"$f":"'SB2'!L57","v":0},{"$f":"'SB2'!M57","v":0}]
[{"$f":"'SB2'!A58","v":"Self-insurance"},null,{"$f":"'SB2'!C58","v":0},{"$f":"'SB2'!D58","v":0},null,null,null,null,null,null,{"$f":"'SB2'!K58","v":0},{"$f":"'SB2'!L58","v":0},{"$f":"'SB2'!M58","v":0}]
[{"$f":"'SB2'!A59","v":"Other reserves (list)"},null,{"$f":"'SB2'!C59","v":0},{"$f":"'SB2'!D59","v":0},null,null,null,null,null,null,{"$f":"'SB2'!K59","v":0},{"$f":"'SB2'!L59","v":0},{"$f":"'SB2'!M59","v":0}]
[null,null,{"$f":"SUM(C53:C56)","v":0},{"$f":"SUM(D53:D56)","v":0},null,null,null,null,null,null,{"$f":"SUM(K53:K56)","v":0},{"$f":"SUM(L53:L56)","v":0},{"$f":"SUM(M53:M56)","v":0}]

{"sheet":"B9-Asset","index":17,"n_rows":227,"n_cols":13,"rows_kept":227,"cut":false,"hidden":false,"merged":[[223,0,223,12],[217,0,217,12],[221,0,221,12],[1,2,1,10],[1,0,3,0],[1,1,3,1],[216,0,216,12],[218,0,218,12],[219,0,219,12]]}
[{"$f":"muni&\" - \"&_ADJ9&\" - \"&Date","v":"LIM332 Greater Letaba - Table B9 Asset Management - 27 February 2019"}]
[{"$f":"desc","v":"Description"},{"$f":"head27","v":"Ref"},{"$f":"Head2","v":"Budget Year 2018/19"},null,null,null,null,null,null,null,null,{"$f":"Head10","v":"Budget Year +1 2019/20"},{"$f":"Head11","v":"Budget Year +2 2020/21"}]
[null,null,{"$f":"Head6","v":"Original Budget"},{"$f":"Head54","v":"Prior Adjusted"},{"$f":"Head51","v":"Accum. Funds"},{"$f":"Head52","v":"Multi-year capital"},{"$f":"Head53","v":"Unfore. Unavoid."},{"$f":"Head55","v":"Nat. or Prov. Govt"},{"$f":"Head50","v":"Other Adjusts."},{"$f":"Head56","v":"Total Adjusts."},{"$f":"Head7","v":"Adjusted Budget"},{"$f":"Head7","v":"Adjusted Budget"},{"$f":"Head7","v":"Adjusted Budget"}]
[null,null,null,7,8,9,10,11,12,13,14]
["R thousands",null,"A","A1","B","C","D","E","F","G","H"]
["CAPITAL EXPENDITURE"]
["Total New Assets to be adjusted",1,{"$f":"C17+C20+C21+C24+C27+C28+SUM(C31:C37)","v":152192808.31999999},{"$f":"D17+D20+D21+D24+D27+D28+SUM(D31:D37)","v":0},0,0,0,0,-5615605,-5615605,146577203.31999999,174388883,192009876]
["Roads Infrastructure",null,{"$f":"SB18a!C9","v":65206303.810000002},{"$f":"SB18a!D9","v":0},{"$f":"SB18a!E9","v":0},{"$f":"SB18a!F9","v":0},{"$f":"SB18a!G9","v":0},{"$f":"SB18a!H9","v":0},{"$f":"SB18a!I9","v":-13212343},{"$f":"SB18a!J9","v":-13212343},{"$f":"SB18a!K9","v":51993960.810000002},{"$f":"SB18a!L9","v":59059811},{"$f":"SB18a!M9","v":88870950}]
["Storm water Infrastructure",null,{"$f":"SB18a!C14","v":5664654.4500000002},{"$f":"SB18a!D14","v":0},{"$f":"SB18a!E14","v":0},{"$f":"SB18a!F14","v":0},{"$f":"SB18a!G14","v":0},{"$f":"SB18a!H14","v":0},{"$f":"SB18a!I14","v":0},{"$f":"SB18a!J14","v":0},{"$f":"SB18a!K14","v":5664654.4500000002},{"$f":"SB18a!L14","v":19013657},{"$f":"SB18a!M14","v":17294945}]
["Electrical Infrastructure",null,{"$f":"SB18a!C18","v":15457760},{"$f":"SB18a!D18","v":0},{"$f":"SB18a!E18","v":0},{"$f":"SB18a!F18","v":0},{"$f":"SB18a!G18","v":0},{"$f":"SB18a!H18","v":0},{"$f":"SB18a!I18","v":6650000},{"$f":"SB18a!J18","v":6650000},{"$f":"SB18a!K18","v":22107760},{"$f":"SB18a!L18","v":23825000},{"$f":"SB18a!M18","v":35169000}]
["Water Supply Infrastructure",null,{"$f":"SB18a!C28","v":0},{"$f":"SB18a!D28","v":0},{"$f":"SB18a!E28","v":0},{"$f":"SB18a!F28","v":0},{"$f":"SB18a!G28","v":0},{"$f":"SB18a!H28","v":0},{"$f":"SB18a!I28","v":0},{"$f":"SB18a!J28","v":0},{"$f":"SB18a!K28","v":0},{"$f":"SB18a!L28","v":0},{"$f":"SB18a!M28","v":0}]
["Sanitation Infrastructure",null,{"$f":"SB18a!C39","v":0},{"$f":"SB18a!D39","v":0},{"$f":"SB18a!E39","v":0},{"$f":"SB18a!F39","v":0},{"$f":"SB18a!G39","v":0},{"$f":"SB18a!H39","v":0},{"$f":"SB18a!I39","v":0},{"$f":"SB18a!J39","v":0},{"$f":"SB18a!K39","v":0},{"$f":"SB18a!L39","v":0},{"$f":"SB18a!M39","v":0}]
["Solid Waste Infrastructure",null,{"$f":"SB18a!C46","v":1700000},{"$f":"SB18a!D46","v":0},{"$f":"SB18a!E46","v":0},{"$f":"SB18a!F46","v":0},{"$f":"SB18a!G46","v":0},{"$f":"SB18a!H46","v":0},{"$f":"SB18a!I46","v":-1700000},{"$f":"SB18a!J46","v":-1700000},{"$f":"SB18a!K46","v":0},{"$f":"SB18a!L46","v":3700000},{"$f":"SB18a!M46","v":0}]
["Rail Infrastructure",null,{"$f":"SB18a!C54","v":0},{"$f":"SB18a!D54","v":0},{"$f":"SB18a!E54","v":0},{"$f":"SB18a!F54","v":0},{"$f":"SB18a!G54","v":0},{"$f":"SB18a!H54","v":0},{"$f":"SB18a!I54","v":0},{"$f":"SB18a!J54","v":0},{"$f":"SB18a!K54","v":0},{"$f":"SB18a!L54","v":0},{"$f":"SB18a!M54","v":0}]
["Coastal Infrastructure",null,{"$f":"SB18a!C64","v":0},{"$f":"SB18a!D64","v":0},{"$f":"SB18a!E64","v":0},{"$f":"SB18a!F64","v":0},{"$f":"SB18a!G64","v":0},{"$f":"SB18a!H64","v":0},{"$f":"SB18a!I64","v":0},{"$f":"SB18a!J64","v":0},{"$f":"SB18a!K64","v":0},{"$f":"SB18a!L64","v":0},{"$f":"SB18a!M64","v":0}]
["Information and Communication Infrastructure",null,{"$f":"SB18a!C70","v":0},{"$f":"SB18a!D70","v":0},{"$f":"SB18a!E70","v":0},{"$f":"SB18a!F70","v":0},{"$f":"SB18a!G70","v":0},{"$f":"SB18a!H70","v":0},{"$f":"SB18a!I70","v":0},{"$f":"SB18a!J70","v":0},{"$f":"SB18a!K70","v":0},{"$f":"SB18a!L70","v":0},{"$f":"SB18a!M70","v":0}]
["Infrastructure",null,{"$f":"SUM(C8:C16)","v":88028718.260000005},{"$f":"SUM(D8:D16)","v":0},0,0,0,0,-8262343,-8262343,79766375.260000005,105598468,141334895]
["Community Facilities",null,{"$f":"SB18a!C77","v":4418446.4000000004},{"$f":"SB18a!D77","v":0},{"$f":"SB18a!E77","v":0},{"$f":"SB18a!F77","v":0},{"$f":"SB18a!G77","v":0},{"$f":"SB18a!H77","v":0},{"$f":"SB18a!I77","v":-2300000},{"$f":"SB18a!J77","v":-2300000},{"$f":"SB18a!K77","v":2118446.4000000004},{"$f":"SB18a!L77","v":4000000},{"$f":"SB18a!M77","v":7500000}]
["Sport and Recreation Facilities",null,{"$f":"SB18a!C100","v":36421985.799999997},{"$f":"SB18a!D100","v":0},{"$f":"SB18a!E100","v":0},{"$f":"SB18a!F100","v":0},{"$f":"SB18a!G100","v":0},{"$f":"SB18a!H100","v":0},{"$f":"SB18a!I100","v":2939900},{"$f":"SB18a!J100","v":2939900},{"$f":"SB18a!K100","v":39361885.799999997},{"$f":"SB18a!L100","v":59635415},{"$f":"SB18a!M100","v":40832889}]
["Community Assets",null,{"$f":"SUM(C18:C19)","v":40840432.199999996},{"$f":"SUM(D18:D19)","v":0},0,0,0,0,639900,639900,41480332.199999996,63635415,48332889]
["Heritage Assets",null,{"$f":"SB18a!C105","v":0},{"$f":"SB18a!D105","v":0},{"$f":"SB18a!E105","v":0},{"$f":"SB18a!F105","v":0},{"$f":"SB18a!G105","v":0},{"$f":"SB18a!H105","v":0},{"$f":"SB18a!I105","v":0},{"$f":"SB18a!J105","v":0},{"$f":"SB18a!K105","v":0},{"$f":"SB18a!L105","v":0},{"$f":"SB18a!M105","v":0}]
["Revenue Generating",null,{"$f":"SB18a!C113","v":0},{"$f":"SB18a!D113","v":0},{"$f":"SB18a!E113","v":0},{"$f":"SB18a!F113","v":0},{"$f":"SB18a!G113","v":0},{"$f":"SB18a!H113","v":0},{"$f":"SB18a!I113","v":0},{"$f":"SB18a!J113","v":0},{"$f":"SB18a!K113","v":0},{"$f":"SB18a!L113","v":0},{"$f":"SB18a!M113","v":0}]
["Non-revenue Generating",null,{"$f":"SB18a!C116","v":0},{"$f":"SB18a!D116","v":0},{"$f":"SB18a!E116","v":0},{"$f":"SB18a!F116","v":0},{"$f":"SB18a!G116","v":0},{"$f":"SB18a!H116","v":0},{"$f":"SB18a!I116","v":0},{"$f":"SB18a!J116","v":0},{"$f":"SB18a!K116","v":0},{"$f":"SB18a!L116","v":0},{"$f":"SB18a!M116","v":0}]
["Investment properties",null,{"$f":"SUM(C22:C23)","v":0},{"$f":"SUM(D22:D23)","v":0},0,0,0,0,0,0,0,0,0]
["Operational Buildings",null,{"$f":"SB18a!C121","v":9383657.8599999994},{"$f":"SB18a!D121","v":0},{"$f":"SB18a!E121","v":0},{"$f":"SB18a!F121","v":0},{"$f":"SB18a!G121","v":0},{"$f":"SB18a!H121","v":0},{"$f":"SB18a!I121","v":-800000},{"$f":"SB18a!J121","v":-800000},{"$f":"SB18a!K121","v":8583657.8599999994},{"$f":"SB18a!L121","v":3955000},{"$f":"SB18a!M121","v":2342092}]
["Housing",null,{"$f":"SB18a!C133","v":0},{"$f":"SB18a!D133","v":0},{"$f":"SB18a!E133","v":0},{"$f":"SB18a!F133","v":0},{"$f":"SB18a!G133","v":0},{"$f":"SB18a!H133","v":0},{"$f":"SB18a!I133","v":0},{"$f":"SB18a!J133","v":0},{"$f":"SB18a!K133","v":0},{"$f":"SB18a!L133","v":0},{"$f":"SB18a!M133","v":0}]
["Other Assets",6,{"$f":"SUM(C25:C26)","v":9383657.8599999994},{"$f":"SUM(D25:D26)","v":0},0,0,0,0,-800000,-800000,8583657.8599999994,3955000,2342092]
["Biological or Cultivated Assets",null,{"$f":"SB18a!C138","v":0},{"$f":"SB18a!D138","v":0},{"$f":"SB18a!E138","v":0},{"$f":"SB18a!F138","v":0},{"$f":"SB18a!G138","v":0},{"$f":"SB18a!H138","v":0},{"$f":"SB18a!I138","v":0},{"$f":"SB18a!J138","v":0},{"$f":"SB18a!K138","v":0},{"$f":"SB18a!L138","v":0},{"$f":"SB18a!M138","v":0}]
["Servitudes",null,{"$f":"SB18a!C142","v":0},{"$f":"SB18a!D142","v":0},{"$f":"SB18a!E142","v":0},{"$f":"SB18a!F142","v":0},{"$f":"SB18a!G142","v":0},{"$f":"SB18a!H142","v":0},{"$f":"SB18a!I142","v":0},{"$f":"SB18a!J142","v":0},{"$f":"SB18a!K142","v":0},{"$f":"SB18a!L142","v":0},{"$f":"SB18a!M142","v":0}]
["Licences and Rights",null,{"$f":"SB18a!C143","v":1050000},{"$f":"SB18a!D143","v":0},{"$f":"SB18a!E143","v":0},{"$f":"SB18a!F143","v":0},{"$f":"SB18a!G143","v":0},{"$f":"SB18a!H143","v":0},{"$f":"SB18a!I143","v":0},{"$f":"SB18a!J143","v":0},{"$f":"SB18a!K143","v":1050000},{"$f":"SB18a!L143","v":0},{"$f":"SB18a!M143","v":0}]
["Intangible Assets",null,{"$f":"SUM(C29:C30)","v":1050000},{"$f":"SUM(D29:D30)","v":0},0,0,0,0,0,0,1050000,0,0]
["Computer Equipment",null,{"$f":"SB18a!C151","v":380000},{"$f":"SB18a!D151","v":0},{"$f":"SB18a!E151","v":0},{"$f":"SB18a!F151","v":0},{"$f":"SB18a!G151","v":0},{"$f":"SB18a!H151","v":0},{"$f":"SB18a!I151","v":0},{"$f":"SB18a!J151","v":0},{"$f":"SB18a!K151","v":380000},{"$f":"SB18a!L151","v":0},{"$f":"SB18a!M151","v":0}]
["Furniture and Office Equipment",null,{"$f":"SB18a!C154","v":1660000},{"$f":"SB18a!D154","v":0},{"$f":"SB18a!E154","v":0},{"$f":"SB18a!F154","v":0},{"$f":"SB18a!G154","v":0},{"$f":"SB18a!H154","v":0},{"$f":"SB18a!I154","v":806838},{"$f":"SB18a!J154","v":806838},{"$f":"SB18a!K154","v":2466838},{"$f":"SB18a!L154","v":0},{"$f":"SB18a!M154","v":0}]
["Machinery and Equipment",null,{"$f":"SB18a!C157","v":9750000},{"$f":"SB18a!D157","v":0},{"$f":"SB18a!E157","v":0},{"$f":"SB18a!F157","v":0},{"$f":"SB18a!G157","v":0},{"$f":"SB18a!H157","v":0},{"$f":"SB18a!I157","v":2000000},{"$f":"SB18a!J157","v":2000000},{"$f":"SB18a!K157","v":11750000},{"$f":"SB18a!L157","v":1200000},{"$f":"SB18a!M157","v":0}]
["Transport Assets",null,{"$f":"SB18a!C160","v":1100000},{"$f":"SB18a!D160","v":0},{"$f":"SB18a!E160","v":0},{"$f":"SB18a!F160","v":0},{"$f":"SB18a!G160","v":0},{"$f":"SB18a!H160","v":0},{"$f":"SB18a!I160","v":0},{"$f":"SB18a!J160","v":0},{"$f":"SB18a!K160","v":1100000},{"$f":"SB18a!L160","v":0},{"$f":"SB18a!M160","v":0}]
["Land",null,{"$f":"SB18a!C163","v":0},{"$f":"SB18a!D163","v":0},{"$f":"SB18a!E163","v":0},{"$f":"SB18a!F163","v":0},{"$f":"SB18a!G163","v":0},{"$f":"SB18a!H163","v":0},{"$f":"SB18a!I163","v":0},{"$f":"SB18a!J163","v":0},{"$f":"SB18a!K163","v":0},{"$f":"SB18a!L163","v":0},{"$f":"SB18a!M163","v":0}]
["Zoo's, Marine and Non-biological Animals",null,{"$f":"SB18a!C166","v":0},{"$f":"SB18a!D166","v":0},{"$f":"SB18a!E166","v":0},{"$f":"SB18a!F166","v":0},{"$f":"SB18a!G166","v":0},{"$f":"SB18a!H166","v":0},{"$f":"SB18a!I166","v":0},{"$f":"SB18a!J166","v":0},{"$f":"SB18a!K166","v":0},{"$f":"SB18a!L166","v":0},{"$f":"SB18a!M166","v":0}]
[]
["Total Renewal of Existing Assets to be adjusted",2,{"$f":"C49+C52+C53+C56+C59+C60+SUM(C63:C69)","v":27083510.539999999},{"$f":"D49+D52+D53+D56+D59+D60+SUM(D63:D69)","v":0},0,0,0,0,0,0,27083510.539999999,0,0]
["Roads Infrastructure",null,{"$f":"SB18b!C9","v":0},{"$f":"SB18b!D9","v":0},{"$f":"SB18b!E9","v":0},{"$f":"SB18b!F9","v":0},{"$f":"SB18b!G9","v":0},{"$f":"SB18b!H9","v":0},{"$f":"SB18b!I9","v":0},{"$f":"SB18b!J9","v":0},{"$f":"SB18b!K9","v":0},{"$f":"SB18b!L9","v":0},{"$f":"SB18b!M9","v":0}]
["Storm water Infrastructure",null,{"$f":"SB18b!C14","v":0},{"$f":"SB18b!D14","v":0},{"$f":"SB18b!E14","v":0},{"$f":"SB18b!F14","v":0},{"$f":"SB18b!G14","v":0},{"$f":"SB18b!H14","v":0},{"$f":"SB18b!I14","v":0},{"$f":"SB18b!J14","v":0},{"$f":"SB18b!K14","v":0},{"$f":"SB18b!L14","v":0},{"$f":"SB18b!M14","v":0}]
["Electrical Infrastructure",null,{"$f":"SB18b!C18","v":0},{"$f":"SB18b!D18","v":0},{"$f":"SB18b!E18","v":0},{"$f":"SB18b!F18","v":0},{"$f":"SB18b!G18","v":0},{"$f":"SB18b!H18","v":0},{"$f":"SB18b!I18","v":0},{"$f":"SB18b!J18","v":0},{"$f":"SB18b!K18","v":0},{"$f":"SB18b!L18","v":0},{"$f":"SB18b!M18","v":0}]
["Water Supply Infrastructure",null,{"$f":"SB18b!C28","v":0},{"$f":"SB18b!D28","v":0},{"$f":"SB18b!E28","v":0},{"$f":"SB18b!F28","v":0},{"$f":"SB18b!G28","v":0},{"$f":"SB18b!H28","v":0},{"$f":"SB18b!I28","v":0},{"$f":"SB18b!J28","v":0},{"$f":"SB18b!K28","v":0},{"$f":"SB18b!L28","v":0},{"$f":"SB18b!M28","v":0}]
["Sanitation Infrastructure",null,{"$f":"SB18b!C39","v":0},{"$f":"SB18b!D39","v":0},{"$f":"SB18b!E39","v":0},{"$f":"SB18b!F39","v":0},{"$f":"SB18b!G39","v":0},{"$f":"SB18b!H39","v":0},{"$f":"SB18b!I39","v":0},{"$f":"SB18b!J39","v":0},{"$f":"SB18b!K39","v":0},{"$f":"SB18b!L39","v":0},{"$f":"SB18b!M39","v":0}]
["Solid Waste Infrastructure",null,{"$f":"SB18b!C46","v":0},{"$f":"SB18b!D46","v":0},{"$f":"SB18b!E46","v":0},{"$f":"SB18b!F46","v":0},{"$f":"SB18b!G46","v":0},{"$f":"SB18b!H46","v":0},{"$f":"SB18b!I46","v":0},{"$f":"SB18b!J46","v":0},{"$f":"SB18b!K46","v":0},{"$f":"SB18b!L46","v":0},{"$f":"SB18b!M46","v":0}]
["Rail Infrastructure",null,{"$f":"SB18b!C54","v":0},{"$f":"SB18b!D54","v":0},{"$f":"SB18b!E54","v":0},{"$f":"SB18b!F54","v":0},{"$f":"SB18b!G54","v":0},{"$f":"SB18b!H54","v":0},{"$f":"SB18b!I54","v":0},{"$f":"SB18b!J54","v":0},{"$f":"SB18b!K54","v":0},{"$f":"SB18b!L54","v":0},{"$f":"SB18b!M54","v":0}]
["Coastal Infrastructure",null,{"$f":"SB18b!C64","v":0},{"$f":"SB18b!D64","v":0},{"$f":"SB18b!E64","v":0},{"$f":"SB18b!F64","v":0},{"$f":"SB18b!G64","v":0},{"$f":"SB18b!H64","v":0},{"$f":"SB18b!I64","v":0},{"$f":"SB18b!J64","v":0},{"$f":"SB18b!K64","v":0},{"$f":"SB18b!L64","v":0},{"$f":"SB18b!M64","v":0}]
["Information and Communication Infrastructure",null,{"$f":"SB18b!C70","v":0},{"$f":"SB18b!D70","v":0},{"$f":"SB18b!E70","v":0},{"$f":"SB18b!F70","v":0},{"$f":"SB18b!G70","v":0},{"$f":"SB18b!H70","v":0},{"$f":"SB18b!I70","v":0},{"$f":"SB18b!J70","v":0},{"$f":"SB18b!K70","v":0},{"$f":"SB18b!L70","v":0},{"$f":"SB18b!M70","v":0}]
["Infrastructure",null,{"$f":"SUM(C40:C48)","v":0},{"$f":"SUM(D40:D48)","v":0},0,0,0,0,0,0,0,0,0]
["Community Facilities",null,{"$f":"SB18b!C77","v":0},{"$f":"SB18b!D77","v":0},{"$f":"SB18b!E77","v":0},{"$f":"SB18b!F77","v":0},{"$f":"SB18b!G77","v":0},{"$f":"SB18b!H77","v":0},{"$f":"SB18b!I77","v":0},{"$f":"SB18b!J77","v":0},{"$f":"SB18b!K77","v":0},{"$f":"SB18b!L77","v":0},{"$f":"SB18b!M77","v":0}]
["Sport and Recreation Facilities",null,{"$f":"SB18b!C100","v":27083510.539999999},{"$f":"SB18b!D100","v":0},{"$f":"SB18b!E100","v":0},{"$f":"SB18b!F100","v":0},{"$f":"SB18b!G100","v":0},{"$f":"SB18b!H100","v":0},{"$f":"SB18b!I100","v":0},{"$f":"SB18b!J100","v":0},{"$f":"SB18b!K100","v":27083510.539999999},{"$f":"SB18b!L100","v":0},{"$f":"SB18b!M100","v":0}]
["Community Assets",null,{"$f":"SUM(C50:C51)","v":27083510.539999999},{"$f":"SUM(D50:D51)","v":0},0,0,0,0,0,0,27083510.539999999,0,0]
["Heritage Assets",null,{"$f":"SB18b!C105","v":0},{"$f":"SB18b!D105","v":0},{"$f":"SB18b!E105","v":0},{"$f":"SB18b!F105","v":0},{"$f":"SB18b!G105","v":0},{"$f":"SB18b!H105","v":0},{"$f":"SB18b!I105","v":0},{"$f":"SB18b!J105","v":0},{"$f":"SB18b!K105","v":0},{"$f":"SB18b!L105","v":0},{"$f":"SB18b!M105","v":0}]
["Revenue Generating",null,{"$f":"SB18b!C113","v":0},{"$f":"SB18b!D113","v":0},{"$f":"SB18b!E113","v":0},{"$f":"SB18b!F113","v":0},{"$f":"SB18b!G113","v":0},{"$f":"SB18b!H113","v":0},{"$f":"SB18b!I113","v":0},{"$f":"SB18b!J113","v":0},{"$f":"SB18b!K113","v":0},{"$f":"SB18b!L113","v":0},{"$f":"SB18b!M113","v":0}]
["Non-revenue Generating",null,{"$f":"SB18b!C116","v":0},{"$f":"SB18b!D116","v":0},{"$f":"SB18b!E116","v":0},{"$f":"SB18b!F116","v":0},{"$f":"SB18b!G116","v":0},{"$f":"SB18b!H116","v":0},{"$f":"SB18b!I116","v":0},{"$f":"SB18b!J116","v":0},{"$f":"SB18b!K116","v":0},{"$f":"SB18b!L116","v":0},{"$f":"SB18b!M116","v":0}]
["Investment properties",null,{"$f":"SUM(C54:C55)","v":0},{"$f":"SUM(D54:D55)","v":0},0,0,0,0,0,0,0,0,0]
["Operational Buildings",null,{"$f":"SB18b!C121","v":0},{"$f":"SB18b!D121","v":0},{"$f":"SB18b!E121","v":0},{"$f":"SB18b!F121","v":0},{"$f":"SB18b!G121","v":0},{"$f":"SB18b!H121","v":0},{"$f":"SB18b!I121","v":0},{"$f":"SB18b!J121","v":0},{"$f":"SB18b!K121","v":0},{"$f":"SB18b!L121","v":0},{"$f":"SB18b!M121","v":0}]
["Housing",null,{"$f":"SB18b!C133","v":0},{"$f":"SB18b!D133","v":0},{"$f":"SB18b!E133","v":0},{"$f":"SB18b!F133","v":0},{"$f":"SB18b!G133","v":0},{"$f":"SB18b!H133","v":0},{"$f":"SB18b!I133","v":0},{"$f":"SB18b!J133","v":0},{"$f":"SB18b!K133","v":0},{"$f":"SB18b!L133","v":0},{"$f":"SB18b!M133","v":0}]
["Other Assets",6,{"$f":"SUM(C57:C58)","v":0},{"$f":"SUM(D57:D58)","v":0},0,0,0,0,0,0,0,0,0]
["Biological or Cultivated Assets",null,{"$f":"SB18b!C138","v":0},{"$f":"SB18b!D138","v":0},{"$f":"SB18b!E138","v":0},{"$f":"SB18b!F138","v":0},{"$f":"SB18b!G138","v":0},{"$f":"SB18b!H138","v":0},{"$f":"SB18b!I138","v":0},{"$f":"SB18b!J138","v":0},{"$f":"SB18b!K138","v":0},{"$f":"SB18b!L138","v":0},{"$f":"SB18b!M138","v":0}]
["Servitudes",null,{"$f":"SB18b!C142","v":0},{"$f":"SB18b!D142","v":0},{"$f":"SB18b!E142","v":0},{"$f":"SB18b!F142","v":0},{"$f":"SB18b!G142","v":0},{"$f":"SB18b!H142","v":0},{"$f":"SB18b!I142","v":0},{"$f":"SB18b!J142","v":0},{"$f":"SB18b!K142","v":0},{"$f":"SB18b!L142","v":0},{"$f":"SB18b!M142","v":0}]
["Licences and Rights",null,{"$f":"SB18b!C143","v":0},{"$f":"SB18b!D143","v":0},{"$f":"SB18b!E143","v":0},{"$f":"SB18b!F143","v":0},{"$f":"SB18b!G143","v":0},{"$f":"SB18b!H143","v":0},{"$f":"SB18b!I143","v":0},{"$f":"SB18b!J143","v":0},{"$f":"SB18b!K143","v":0},{"$f":"SB18b!L143","v":0},{"$f":"SB18b!M143","v":0}]
["Intangible Assets",null,{"$f":"SUM(C61:C62)","v":0},{"$f":"SUM(D61:D62)","v":0},0,0,0,0,0,0,0,0,0]
["Computer Equipment",null,{"$f":"SB18b!C151","v":0},{"$f":"SB18b!D151","v":0},{"$f":"SB18b!E151","v":0},{"$f":"SB18b!F151","v":0},{"$f":"SB18b!G151","v":0},{"$f":"SB18b!H151","v":0},{"$f":"SB18b!I151","v":0},{"$f":"SB18b!J151","v":0},{"$f":"SB18b!K151","v":0},{"$f":"SB18b!L151","v":0},{"$f":"SB18b!M151","v":0}]
["Furniture and Office Equipment",null,{"$f":"SB18b!C154","v":0},{"$f":"SB18b!D154","v":0},{"$f":"SB18b!E154","v":0},{"$f":"SB18b!F154","v":0},{"$f":"SB18b!G154","v":0},{"$f":"SB18b!H154","v":0},{"$f":"SB18b!I154","v":0},{"$f":"SB18b!J154","v":0},{"$f":"SB18b!K154","v":0},{"$f":"SB18b!L154","v":0},{"$f":"SB18b!M154","v":0}]
["Machinery and Equipment",null,{"$f":"SB18b!C157","v":0},{"$f":"SB18b!D157","v":0},{"$f":"SB18b!E157","v":0},{"$f":"SB18b!F157","v":0},{"$f":"SB18b!G157","v":0},{"$f":"SB18b!H157","v":0},{"$f":"SB18b!I157","v":0},{"$f":"SB18b!J157","v":0},{"$f":"SB18b!K157","v":0},{"$f":"SB18b!L157","v":0},{"$f":"SB18b!M157","v":0}]
["Transport Assets",null,{"$f":"SB18b!C160","v":0},{"$f":"SB18b!D160","v":0},{"$f":"SB18b!E160","v":0},{"$f":"SB18b!F160","v":0},{"$f":"SB18b!G160","v":0},{"$f":"SB18b!H160","v":0},{"$f":"SB18b!I160","v":0},{"$f":"SB18b!J160","v":0},{"$f":"SB18b!K160","v":0},{"$f":"SB18b!L160","v":0},{"$f":"SB18b!M160","v":0}]
["Land",null,{"$f":"SB18b!C163","v":0},{"$f":"SB18b!D163","v":0},{"$f":"SB18b!E163","v":0},{"$f":"SB18b!F163","v":0},{"$f":"SB18b!G163","v":0},{"$f":"SB18b!H163","v":0},{"$f":"SB18b!I163","v":0},{"$f":"SB18b!J163","v":0},{"$f":"SB18b!K163","v":0},{"$f":"SB18b!L163","v":0},{"$f":"SB18b!M163","v":0}]
["Zoo's, Marine and Non-biological Animals",null,{"$f":"SB18b!C166","v":0},{"$f":"SB18b!D166","v":0},{"$f":"SB18b!E166","v":0},{"$f":"SB18b!F166","v":0},{"$f":"SB18b!G166","v":0},{"$f":"SB18b!H166","v":0},{"$f":"SB18b!I166","v":0},{"$f":"SB18b!J166","v":0},{"$f":"SB18b!K166","v":0},{"$f":"SB18b!L166","v":0},{"$f":"SB18b!M166","v":0}]
[]
["Total Upgrading of Existing Assets to be adjusted","2a",{"$f":"C81+C84+C85+C88+C91+C92+SUM(C95:C101)","v":0},{"$f":"D81+D84+D85+D88+D91+D92+SUM(D95:D101)","v":0},0,0,0,0,0,0,0,0,0]
["Roads Infrastructure",null,{"$f":"SB18e!C9","v":0},{"$f":"SB18e!D9","v":0},{"$f":"SB18e!E9","v":0},{"$f":"SB18e!F9","v":0},{"$f":"SB18e!G9","v":0},{"$f":"SB18e!H9","v":0},{"$f":"SB18e!I9","v":0},{"$f":"SB18e!J9","v":0},{"$f":"SB18e!K9","v":0},{"$f":"SB18e!L9","v":0},{"$f":"SB18e!M9","v":0}]
["Storm water Infrastructure",null,{"$f":"SB18e!C14","v":0},{"$f":"SB18e!D14","v":0},{"$f":"SB18e!E14","v":0},{"$f":"SB18e!F14","v":0},{"$f":"SB18e!G14","v":0},{"$f":"SB18e!H14","v":0},{"$f":"SB18e!I14","v":0},{"$f":"SB18e!J14","v":0},{"$f":"SB18e!K14","v":0},{"$f":"SB18e!L14","v":0},{"$f":"SB18e!M14","v":0}]
["Electrical Infrastructure",null,{"$f":"SB18e!C18","v":0},{"$f":"SB18e!D18","v":0},{"$f":"SB18e!E18","v":0},{"$f":"SB18e!F18","v":0},{"$f":"SB18e!G18","v":0},{"$f":"SB18e!H18","v":0},{"$f":"SB18e!I18","v":0},{"$f":"SB18e!J18","v":0},{"$f":"SB18e!K18","v":0},{"$f":"SB18e!L18","v":0},{"$f":"SB18e!M18","v":0}]
["Water Supply Infrastructure",null,{"$f":"SB18e!C28","v":0},{"$f":"SB18e!D28","v":0},{"$f":"SB18e!E28","v":0},{"$f":"SB18e!F28","v":0},{"$f":"SB18e!G28","v":0},{"$f":"SB18e!H28","v":0},{"$f":"SB18e!I28","v":0},{"$f":"SB18e!J28","v":0},{"$f":"SB18e!K28","v":0},{"$f":"SB18e!L28","v":0},{"$f":"SB18e!M28","v":0}]
["Sanitation Infrastructure",null,{"$f":"SB18e!C39","v":0},{"$f":"SB18e!D39","v":0},{"$f":"SB18e!E39","v":0},{"$f":"SB18e!F39","v":0},{"$f":"SB18e!G39","v":0},{"$f":"SB18e!H39","v":0},{"$f":"SB18e!I39","v":0},{"$f":"SB18e!J39","v":0},{"$f":"SB18e!K39","v":0},{"$f":"SB18e!L39","v":0},{"$f":"SB18e!M39","v":0}]
["Solid Waste Infrastructure",null,{"$f":"SB18e!C46","v":0},{"$f":"SB18e!D46","v":0},{"$f":"SB18e!E46","v":0},{"$f":"SB18e!F46","v":0},{"$f":"SB18e!G46","v":0},{"$f":"SB18e!H46","v":0},{"$f":"SB18e!I46","v":0},{"$f":"SB18e!J46","v":0},{"$f":"SB18e!K46","v":0},{"$f":"SB18e!L46","v":0},{"$f":"SB18e!M46","v":0}]
["Rail Infrastructure",null,{"$f":"SB18e!C54","v":0},{"$f":"SB18e!D54","v":0},{"$f":"SB18e!E54","v":0},{"$f":"SB18e!F54","v":0},{"$f":"SB18e!G54","v":0},{"$f":"SB18e!H54","v":0},{"$f":"SB18e!I54","v":0},{"$f":"SB18e!J54","v":0},{"$f":"SB18e!K54","v":0},{"$f":"SB18e!L54","v":0},{"$f":"SB18e!M54","v":0}]
["Coastal Infrastructure",null,{"$f":"SB18e!C64","v":0},{"$f":"SB18e!D64","v":0},{"$f":"SB18e!E64","v":0},{"$f":"SB18e!F64","v":0},{"$f":"SB18e!G64","v":0},{"$f":"SB18e!H64","v":0},{"$f":"SB18e!I64","v":0},{"$f":"SB18e!J64","v":0},{"$f":"SB18e!K64","v":0},{"$f":"SB18e!L64","v":0},{"$f":"SB18e!M64","v":0}]
["Information and Communication Infrastructure",null,{"$f":"SB18e!C70","v":0},{"$f":"SB18e!D70","v":0},{"$f":"SB18e!E70","v":0},{"$f":"SB18e!F70","v":0},{"$f":"SB18e!G70","v":0},{"$f":"SB18e!H70","v":0},{"$f":"SB18e!I70","v":0},{"$f":"SB18e!J70","v":0},{"$f":"SB18e!K70","v":0},{"$f":"SB18e!L70","v":0},{"$f":"SB18e!M70","v":0}]
["Infrastructure",null,{"$f":"SUM(C72:C80)","v":0},{"$f":"SUM(D72:D80)","v":0},0,0,0,0,0,0,0,0,0]
["Community Facilities",null,{"$f":"SB18e!C77","v":0},{"$f":"SB18e!D77","v":0},{"$f":"SB18e!E77","v":0},{"$f":"SB18e!F77","v":0},{"$f":"SB18e!G77","v":0},{"$f":"SB18e!H77","v":0},{"$f":"SB18e!I77","v":0},{"$f":"SB18e!J77","v":0},{"$f":"SB18e!K77","v":0},{"$f":"SB18e!L77","v":0},{"$f":"SB18e!M77","v":0}]
["Sport and Recreation Facilities",null,{"$f":"SB18e!C100","v":0},{"$f":"SB18e!D100","v":0},{"$f":"SB18e!E100","v":0},{"$f":"SB18e!F100","v":0},{"$f":"SB18e!G100","v":0},{"$f":"SB18e!H100","v":0},{"$f":"SB18e!I100","v":0},{"$f":"SB18e!J100","v":0},{"$f":"SB18e!K100","v":0},{"$f":"SB18e!L100","v":0},{"$f":"SB18e!M100","v":0}]
["Community Assets",null,{"$f":"SUM(C82:C83)","v":0},{"$f":"SUM(D82:D83)","v":0},0,0,0,0,0,0,0,0,0]
["Heritage Assets",null,{"$f":"SB18e!C105","v":0},{"$f":"SB18e!D105","v":0},{"$f":"SB18e!E105","v":0},{"$f":"SB18e!F105","v":0},{"$f":"SB18e!G105","v":0},{"$f":"SB18e!H105","v":0},{"$f":"SB18e!I105","v":0},{"$f":"SB18e!J105","v":0},{"$f":"SB18e!K105","v":0},{"$f":"SB18e!L105","v":0},{"$f":"SB18e!M105","v":0}]
["Revenue Generating",null,{"$f":"SB18e!C113","v":0},{"$f":"SB18e!D113","v":0},{"$f":"SB18e!E113","v":0},{"$f":"SB18e!F113","v":0},{"$f":"SB18e!G113","v":0},{"$f":"SB18e!H113","v":0},{"$f":"SB18e!I113","v":0},{"$f":"SB18e!J113","v":0},{"$f":"SB18e!K113","v":0},{"$f":"SB18e!L113","v":0},{"$f":"SB18e!M113","v":0}]
["Non-revenue Generating",null,{"$f":"SB18e!C116","v":0},{"$f":"SB18e!D116","v":0},{"$f":"SB18e!E116","v":0},{"$f":"SB18e!F116","v":0},{"$f":"SB18e!G116","v":0},{"$f":"SB18e!H116","v":0},{"$f":"SB18e!I116","v":0},{"$f":"SB18e!J116","v":0},{"$f":"SB18e!K116","v":0},{"$f":"SB18e!L116","v":0},{"$f":"SB18e!M116","v":0}]
["Investment properties",null,{"$f":"SUM(C86:C87)","v":0},{"$f":"SUM(D86:D87)","v":0},0,0,0,0,0,0,0,0,0]
["Operational Buildings",null,{"$f":"SB18e!C121","v":0},{"$f":"SB18e!D121","v":0},{"$f":"SB18e!E121","v":0},{"$f":"SB18e!F121","v":0},{"$f":"SB18e!G121","v":0},{"$f":"SB18e!H121","v":0},{"$f":"SB18e!I121","v":0},{"$f":"SB18e!J121","v":0},{"$f":"SB18e!K121","v":0},{"$f":"SB18e!L121","v":0},{"$f":"SB18e!M121","v":0}]
["Housing",null,{"$f":"SB18e!C133","v":0},{"$f":"SB18e!D133","v":0},{"$f":"SB18e!E133","v":0},{"$f":"SB18e!F133","v":0},{"$f":"SB18e!G133","v":0},{"$f":"SB18e!H133","v":0},{"$f":"SB18e!I133","v":0},{"$f":"SB18e!J133","v":0},{"$f":"SB18e!K133","v":0},{"$f":"SB18e!L133","v":0},{"$f":"SB18e!M133","v":0}]
["Other Assets",6,{"$f":"SUM(C89:C90)","v":0},{"$f":"SUM(D89:D90)","v":0},0,0,0,0,0,0,0,0,0]
["Biological or Cultivated Assets",null,{"$f":"SB18e!C138","v":0},{"$f":"SB18e!D138","v":0},{"$f":"SB18e!E138","v":0},{"$f":"SB18e!F138","v":0},{"$f":"SB18e!G138","v":0},{"$f":"SB18e!H138","v":0},{"$f":"SB18e!I138","v":0},{"$f":"SB18e!J138","v":0},{"$f":"SB18e!K138","v":0},{"$f":"SB18e!L138","v":0},{"$f":"SB18e!M138","v":0}]
["Servitudes",null,{"$f":"SB18e!C142","v":0},{"$f":"SB18e!D142","v":0},{"$f":"SB18e!E142","v":0},{"$f":"SB18e!F142","v":0},{"$f":"SB18e!G142","v":0},{"$f":"SB18e!H142","v":0},{"$f":"SB18e!I142","v":0},{"$f":"SB18e!J142","v":0},{"$f":"SB18e!K142","v":0},{"$f":"SB18e!L142","v":0},{"$f":"SB18e!M142","v":0}]
["Licences and Rights",null,{"$f":"SB18e!C143","v":0},{"$f":"SB18e!D143","v":0},{"$f":"SB18e!E143","v":0},{"$f":"SB18e!F143","v":0},{"$f":"SB18e!G143","v":0},{"$f":"SB18e!H143","v":0},{"$f":"SB18e!I143","v":0},{"$f":"SB18e!J143","v":0},{"$f":"SB18e!K143","v":0},{"$f":"SB18e!L143","v":0},{"$f":"SB18e!M143","v":0}]
["Intangible Assets",null,{"$f":"SUM(C93:C94)","v":0},{"$f":"SUM(D93:D94)","v":0},0,0,0,0,0,0,0,0,0]
["Computer Equipment",null,{"$f":"SB18e!C151","v":0},{"$f":"SB18e!D151","v":0},{"$f":"SB18e!E151","v":0},{"$f":"SB18e!F151","v":0},{"$f":"SB18e!G151","v":0},{"$f":"SB18e!H151","v":0},{"$f":"SB18e!I151","v":0},{"$f":"SB18e!J151","v":0},{"$f":"SB18e!K151","v":0},{"$f":"SB18e!L151","v":0},{"$f":"SB18e!M151","v":0}]
["Furniture and Office Equipment",null,{"$f":"SB18e!C154","v":0},{"$f":"SB18e!D154","v":0},{"$f":"SB18e!E154","v":0},{"$f":"SB18e!F154","v":0},{"$f":"SB18e!G154","v":0},{"$f":"SB18e!H154","v":0},{"$f":"SB18e!I154","v":0},{"$f":"SB18e!J154","v":0},{"$f":"SB18e!K154","v":0},{"$f":"SB18e!L154","v":0},{"$f":"SB18e!M154","v":0}]
["Machinery and Equipment",null,{"$f":"SB18e!C157","v":0},{"$f":"SB18e!D157","v":0},{"$f":"SB18e!E157","v":0},{"$f":"SB18e!F157","v":0},{"$f":"SB18e!G157","v":0},{"$f":"SB18e!H157","v":0},{"$f":"SB18e!I157","v":0},{"$f":"SB18e!J157","v":0},{"$f":"SB18e!K157","v":0},{"$f":"SB18e!L157","v":0},{"$f":"SB18e!M157","v":0}]
["Transport Assets",null,{"$f":"SB18e!C160","v":0},{"$f":"SB18e!D160","v":0},{"$f":"SB18e!E160","v":0},{"$f":"SB18e!F160","v":0},{"$f":"SB18e!G160","v":0},{"$f":"SB18e!H160","v":0},{"$f":"SB18e!I160","v":0},{"$f":"SB18e!J160","v":0},{"$f":"SB18e!K160","v":0},{"$f":"SB18e!L160","v":0},{"$f":"SB18e!M160","v":0}]
["Land",null,{"$f":"SB18e!C163","v":0},{"$f":"SB18e!D163","v":0},{"$f":"SB18e!E163","v":0},{"$f":"SB18e!F163","v":0},{"$f":"SB18e!G163","v":0},{"$f":"SB18e!H163","v":0},{"$f":"SB18e!I163","v":0},{"$f":"SB18e!J163","v":0},{"$f":"SB18e!K163","v":0},{"$f":"SB18e!L163","v":0},{"$f":"SB18e!M163","v":0}]
["Zoo's, Marine and Non-biological Animals",null,{"$f":"SB18e!C166","v":0},{"$f":"SB18e!D166","v":0},{"$f":"SB18e!E166","v":0},{"$f":"SB18e!F166","v":0},{"$f":"SB18e!G166","v":0},{"$f":"SB18e!H166","v":0},{"$f":"SB18e!I166","v":0},{"$f":"SB18e!J166","v":0},{"$f":"SB18e!K166","v":0},{"$f":"SB18e!L166","v":0},{"$f":"SB18e!M166","v":0}]
[]
["Total Capital Expenditure to be adjusted",4]
["Roads Infrastructure",null,{"$f":"C8+C40+C72","v":65206303.810000002},{"$f":"D8+D40+D72","v":0},0,0,0,0,-13212343,-13212343,51993960.810000002,59059811,88870950]
["Storm water Infrastructure",null,5664654.4500000002,0,0,0,0,0,0,0,5664654.4500000002,19013657,17294945]
["Electrical Infrastructure",null,15457760,0,0,0,0,0,6650000,6650000,22107760,23825000,35169000]
["Water Supply Infrastructure",null,0,{"$f":"D11+D43+D75","v":0},0,0,0,0,0,0,0,0,0]
["Sanitation Infrastructure",null,0,{"$f":"D12+D44+D76","v":0},0,0,0,0,0,0,0,0,0]
["Solid Waste Infrastructure",null,1700000,{"$f":"D13+D45+D77","v":0},0,0,0,0,-1700000,-1700000,0,3700000,0]
["Rail Infrastructure",null,0,{"$f":"D14+D46+D78","v":0},0,0,0,0,0,0,0,0,0]
["Coastal Infrastructure",null,0,{"$f":"D15+D47+D79","v":0},0,0,0,0,0,0,0,0,0]
["Information and Communication Infrastructure",null,0,{"$f":"D16+D48+D80","v":0},0,0,0,0,0,0,0,0,0]
["Infrastructure",null,88028718.260000005,{"$f":"D17+D49+D81","v":0},0,0,0,0,-8262343,-8262343,79766375.260000005,105598468,141334895]
["Community Facilities",null,4418446.4000000004,{"$f":"D18+D50+D82","v":0},0,0,0,0,-2300000,-2300000,2118446.4000000004,4000000,7500000]
["Sport and Recreation Facilities",null,63505496.339999996,{"$f":"D19+D51+D83","v":0},0,0,0,0,2939900,2939900,66445396.339999996,59635415,40832889]
["Community Assets",null,67923942.739999995,{"$f":"D20+D52+D84","v":0},0,0,0,0,639900,639900,68563842.739999995,63635415,48332889]
["Heritage Assets",null,0,{"$f":"D21+D53+D85","v":0},0,0,0,0,0,0,0,0,0]
["Revenue Generating",null,0,{"$f":"D22+D54+D86","v":0},0,0,0,0,0,0,0,0,0]
["Non-revenue Generating",null,0,{"$f":"D23+D55+D87","v":0},0,0,0,0,0,0,0,0,0]
["Investment properties",null,0,{"$f":"D24+D56+D88","v":0},0,0,0,0,0,0,0,0,0]
["Operational Buildings",null,9383657.8599999994,{"$f":"D25+D57+D89","v":0},0,0,0,0,-800000,-800000,8583657.8599999994,3955000,2342092]
["Housing",null,0,{"$f":"D26+D58+D90","v":0},0,0,0,0,0,0,0,0,0]
["Other Assets",null,9383657.8599999994,{"$f":"D27+D59+D91","v":0},0,0,0,0,-800000,-800000,8583657.8599999994,3955000,2342092]
["Biological or Cultivated Assets",null,0,{"$f":"D28+D60+D92","v":0},0,0,0,0,0,0,0,0,0]
["Servitudes",null,0,{"$f":"D29+D61+D93","v":0},0,0,0,0,0,0,0,0,0]
["Licences and Rights",null,1050000,{"$f":"D30+D62+D94","v":0},0,0,0,0,0,0,1050000,0,0]
["Intangible Assets",null,1050000,{"$f":"D31+D63+D95","v":0},0,0,0,0,0,0,1050000,0,0]
["Computer Equipment",null,380000,{"$f":"D32+D64+D96","v":0},0,0,0,0,0,0,380000,0,0]
["Furniture and Office Equipment",null,1660000,{"$f":"D33+D65+D97","v":0},0,0,0,0,806838,806838,2466838,0,0]
["Machinery and Equipment",null,9750000,{"$f":"D34+D66+D98","v":0},0,0,0,0,2000000,2000000,11750000,1200000,0]
["Transport Assets",null,1100000,{"$f":"D35+D67+D99","v":0},0,0,0,0,0,0,1100000,0,0]
["Land",null,0,{"$f":"D36+D68+D100","v":0},0,0,0,0,0,0,0,0,0]
["Zoo's, Marine and Non-biological Animals",null,0,{"$f":"D37+D69+D101","v":0},0,0,0,0,0,0,0,0,0]
["TOTAL CAPITAL EXPENDITURE to be adjusted",4,{"$f":"C7+C39+C71","v":179276318.85999998},{"$f":"D7+D39+D71","v":0},0,0,0,0,-5615605,-5615605,173660713.85999998,174388883,192009876]
[]
["ASSET REGISTER SUMMARY - PPE (WDV)",5]
[{"$f":"+A8","v":"Roads Infrastructure"},null,{"$f":"441610253+2500000+1700000+1200000+800000+800000+6000000+400000+600000+600000+5283210+7450000+4987800+5503600+5401000+50000000","v":534835863},null,null,null,null,null,{"$f":"-13212343-2000000","v":-15212343},{"$f":"SUM(E137:I137)","v":-15212343},{"$f":"IF(D137=0,C137+J137,D137+J137)","v":519623520},{"$f":"441610253+2500000+1700000+1200000+800000+800000+6000000+400000+600000+600000+5283210+7450000+4987800+5503600+5401000+85000000+1400000+12339739.5452082","v":583575602.54520822},{"$f":"441610253+2500000+1700000+1200000+800000+800000+6000000+400000+600000+600000+5283210+7450000+4987800+5503600+5401000+91000000+19120548.2540743","v":594956411.25407434}]
[{"$f":"+A9","v":"Storm water Infrastructure"},null,0,null,null,null,null,null,null,0,{"$f":"IF(D138=0,C138+J138,D138+J138)","v":0}]
["Electrical Infrastructure",null,{"$f":"60068441+20000000-6439283.39526117","v":73629157.604738832},null,null,null,null,null,{"$f":"1477256+6650000","v":8127256},8127256,{"$f":"IF(D139=0,C139+J139,D139+J139)","v":81756413.604738832},{"$f":"60068441+18410000+3500000","v":81978441},{"$f":"60068441+21450000","v":81518441}]
["Water Supply Infrastructure",null,0,null,null,null,null,null,null,0,{"$f":"IF(D140=0,C140+J140,D140+J140)","v":0},0,0]
["Sanitation Infrastructure",null,0,null,null,null,null,null,null,0,{"$f":"IF(D141=0,C141+J141,D141+J141)","v":0},0,0]
["Solid Waste Infrastructure",null,{"$f":"2997102+2000000","v":4997102},null,null,null,null,null,{"$f":"-1000000+800000","v":-200000},-200000,4797102,{"$f":"2997102+2000000+300000","v":5297102},2997102]
["Rail Infrastructure",null,0,null,null,null,null,null,null,0,0,0,0]
["Coastal Infrastructure",null,0,null,null,null,null,null,null,0,0,0,0]
["Information and Communication Infrastructure",null,0,null,null,null,null,null,null,0,0,0,0]
["Infrastructure",null,{"$f":"SUM(C137:C145)","v":613462122.60473883},0,0,0,0,0,-7285087,-7285087,606177035.60473883,{"$f":"SUM(L137:L145)","v":670851145.54520822},{"$f":"SUM(M137:M145)","v":679471954.25407434}]
["Community Facilities",null,0,null,null,null,null,null,null,{"$f":"SUM(E147:I147)","v":0},{"$f":"IF(D147=0,C147+J147,D147+J147)","v":0},0,0]
["Sport and Recreation Facilities",null,{"$f":"165446335+5593206+5593206+13050771+11884803","v":201568321},null,null,null,null,null,{"$f":"-500000-600000-400000+3165815","v":1665815},{"$f":"SUM(E148:I148)","v":1665815},{"$f":"IF(D148=0,C148+J148,D148+J148)","v":203234136},{"$f":"165446335+5593206+5593206+13050771+11884803+13902226+10000000+17000000+17000000+25000000","v":284470547},{"$f":"165446335+5593206+5593206+13050771+11884803+13902226+10000000+17000000+17000000+17341500+16341500","v":293153547}]
["Community Assets",null,{"$f":"SUM(C147:C148)","v":201568321},{"$f":"SUM(D147:D148)","v":0},0,0,0,0,1665815,1665815,203234136,284470547,293153547]
["Heritage Assets",null,null,null,null,null,null,null,null,{"$f":"SUM(E150:I150)","v":0},0]
["Revenue Generating",null,null,null,null,null,null,null,null,{"$f":"SUM(E151:I151)","v":0},0]
["Non-revenue Generating",null,null,null,null,null,null,null,null,{"$f":"SUM(E152:I152)","v":0},0]
["Investment properties",null,{"$f":"SUM(C151:C152)","v":0},0,0,0,0,0,0,0,0,0,0]
["Operational Buildings",null,null,null,null,null,null,null,null,{"$f":"SUM(E154:I154)","v":0},{"$f":"IF(D154=0,C154+J154,D154+J154)","v":0}]
["Housing",null,null,null,null,null,null,null,null,{"$f":"SUM(E155:I155)","v":0},{"$f":"IF(D155=0,C155+J155,D155+J155)","v":0}]
["Other Assets",null,{"$f":"SUM(C154:C155)","v":0},0,0,0,0,0,0,0,0,0,0]
["Biological or Cultivated Assets",null,null,null,null,null,null,null,null,{"$f":"SUM(E157:I157)","v":0},{"$f":"IF(D157=0,C157+J157,D157+J157)","v":0}]
["Servitudes",null,null,null,null,null,null,null,null,{"$f":"SUM(E158:I158)","v":0},0]
["Licences and Rights",null,null,null,null,null,null,null,null,{"$f":"SUM(E159:I159)","v":0},0]
["Intangible Assets",null,{"$f":"SUM(C158:C159)","v":0},0,0,0,0,0,0,0,0,0,0]
["Computer Equipment",null,{"$f":"2497928+180000+200000","v":2877928},null,null,null,null,null,{"$f":"1156827-200000","v":956827},{"$f":"SUM(E161:I161)","v":956827},{"$f":"IF(D161=0,C161+J161,D161+J161)","v":3834755},{"$f":"2497928+380000+350000+25000","v":3252928},{"$f":"2497928+380000+350000","v":3227928}]
["Furniture and Office Equipment",null,{"$f":"6607690+390000","v":6997690},null,null,null,null,null,{"$f":"806838+170000+1000000-200000-800000-600000","v":376838},376838,7374528,{"$f":"6607690+2500000","v":9107690},6607690]
["Machinery and Equipment",null,{"$f":"1500000+400000+13443574+820000","v":16163574},null,null,null,null,null,-1330306,-1330306,14833268,{"$f":"1500000+400000+13443574+5000000","v":20343574},{"$f":"1500000+400000+13443574","v":15343574}]
["Transport Assets",null,{"$f":"12703451+600000","v":13303451},null,null,null,null,null,0,0,13303451,{"$f":"12703451+2500000+1000000","v":16203451},12703451]
["Land",null,0,null,null,null,null,null,null,0,0,0,0]
["Zoo's, Marine and Non-biological Animals",null,0,null,null,null,null,null,null,0,0,0,0]
["TOTAL ASSET REGISTER SUMMARY - PPE (WDV)",5,{"$f":"C146+C149+C150+C153+C156+C157+SUM(C160:C166)","v":854373086.60473883},{"$f":"D146+D149+D150+D153+D156+D157+SUM(D160:D166)","v":0},0,0,0,0,-5615913,-5615913,848757173.60473883,1004229335.5452082,1010508144.2540743]
[]
["EXPENDITURE OTHER ITEMS"]
["Depreciation & asset impairment",null,{"$f":"SB18d!C169","v":5043379.8119640006},{"$f":"SB18d!D169","v":0},{"$f":"SB18d!E169","v":0},{"$f":"SB18d!F169","v":0},{"$f":"SB18d!G169","v":0},{"$f":"SB18d!H169","v":0},{"$f":"SB18d!I169","v":898831.77},{"$f":"SB18d!J169","v":898831.77},{"$f":"SB18d!K169","v":5942211.5819640011},{"$f":"SB18d!L169","v":6865247.6830960549},{"$f":"SB18d!M169","v":7311489.3182064854}]
["Repairs and Maintenance by asset class",3,{"$f":"C181+C184+C185+C188+C191+C192+SUM(C195:C201)","v":22098649.140000001},{"$f":"D181+D184+D185+D188+D191+D192+SUM(D195:D201)","v":0},{"$f":"E181+E184+E185+E188+E191+E192+SUM(E195:E201)","v":0},{"$f":"F181+F184+F185+F188+F191+F192+SUM(F195:F201)","v":0},0,0,668652,668652,22767301.140000001,{"$f":"L181+L184+L185+L188+L191+L192+SUM(L195:L201)","v":11633000},{"$f":"M181+M184+M185+M188+M191+M192+SUM(M195:M201)","v":12343000}]
[{"$f":"+A8","v":"Roads Infrastructure"},null,{"$f":"SB18c!C9","v":9315704},{"$f":"SB18c!D9","v":0},{"$f":"SB18c!E9","v":0},{"$f":"SB18c!F9","v":0},{"$f":"SB18c!G9","v":0},{"$f":"SB18c!H9","v":0},{"$f":"SB18c!I9","v":668652},{"$f":"SB18c!J9","v":668652},{"$f":"SB18c!K9","v":9984356},{"$f":"SB18c!L9","v":2549000},{"$f":"SB18c!M9","v":3799000}]
[{"$f":"+A9","v":"Storm water Infrastructure"},null,{"$f":"SB18c!C14","v":0},{"$f":"SB18c!D14","v":0},{"$f":"SB18c!E14","v":0},{"$f":"SB18c!F14","v":0},{"$f":"SB18c!G14","v":0},{"$f":"SB18c!H14","v":0},{"$f":"SB18c!I14","v":0},{"$f":"SB18c!J14","v":0},{"$f":"SB18c!K14","v":0},{"$f":"SB18c!L14","v":0},{"$f":"SB18c!M14","v":0}]
["Electrical Infrastructure",null,{"$f":"SB18c!C18","v":4752470},{"$f":"SB18c!D18","v":0},{"$f":"SB18c!E18","v":0},{"$f":"SB18c!F18","v":0},{"$f":"SB18c!G18","v":0},{"$f":"SB18c!H18","v":0},{"$f":"SB18c!I18","v":0},{"$f":"SB18c!J18","v":0},{"$f":"SB18c!K18","v":4752470},{"$f":"SB18c!L18","v":2009000},{"$f":"SB18c!M18","v":2613000}]
["Water Supply Infrastructure",null,{"$f":"SB18c!C28","v":0},{"$f":"SB18c!D28","v":0},{"$f":"SB18c!E28","v":0},{"$f":"SB18c!F28","v":0},{"$f":"SB18c!G28","v":0},{"$f":"SB18c!H28","v":0},{"$f":"SB18c!I28","v":0},{"$f":"SB18c!J28","v":0},{"$f":"SB18c!K28","v":0},{"$f":"SB18c!L28","v":0},{"$f":"SB18c!M28","v":0}]
["Sanitation Infrastructure",null,{"$f":"SB18c!C39","v":0},{"$f":"SB18c!D39","v":0},{"$f":"SB18c!E39","v":0},{"$f":"SB18c!F39","v":0},{"$f":"SB18c!G39","v":0},{"$f":"SB18c!H39","v":0},{"$f":"SB18c!I39","v":0},{"$f":"SB18c!J39","v":0},{"$f":"SB18c!K39","v":0},{"$f":"SB18c!L39","v":0},{"$f":"SB18c!M39","v":0}]
["Solid Waste Infrastructure",null,{"$f":"SB18c!C46","v":0},{"$f":"SB18c!D46","v":0},{"$f":"SB18c!E46","v":0},{"$f":"SB18c!F46","v":0},{"$f":"SB18c!G46","v":0},{"$f":"SB18c!H46","v":0},{"$f":"SB18c!I46","v":0},{"$f":"SB18c!J46","v":0},{"$f":"SB18c!K46","v":0},{"$f":"SB18c!L46","v":0},{"$f":"SB18c!M46","v":0}]
["Rail Infrastructure",null,{"$f":"SB18c!C54","v":0},{"$f":"SB18c!D54","v":0},{"$f":"SB18c!E54","v":0},{"$f":"SB18c!F54","v":0},{"$f":"SB18c!G54","v":0},{"$f":"SB18c!H54","v":0},{"$f":"SB18c!I54","v":0},{"$f":"SB18c!J54","v":0},{"$f":"SB18c!K54","v":0},{"$f":"SB18c!L54","v":0},{"$f":"SB18c!M54","v":0}]
["Coastal Infrastructure",null,{"$f":"SB18c!C64","v":0},{"$f":"SB18c!D64","v":0},{"$f":"SB18c!E64","v":0},{"$f":"SB18c!F64","v":0},{"$f":"SB18c!G64","v":0},{"$f":"SB18c!H64","v":0},{"$f":"SB18c!I64","v":0},{"$f":"SB18c!J64","v":0},{"$f":"SB18c!K64","v":0},{"$f":"SB18c!L64","v":0},{"$f":"SB18c!M64","v":0}]
["Information and Communication Infrastructure",null,{"$f":"SB18c!C70","v":0},{"$f":"SB18c!D70","v":0},{"$f":"SB18c!E70","v":0},{"$f":"SB18c!F70","v":0},{"$f":"SB18c!G70","v":0},{"$f":"SB18c!H70","v":0},{"$f":"SB18c!I70","v":0},{"$f":"SB18c!J70","v":0},{"$f":"SB18c!K70","v":0},{"$f":"SB18c!L70","v":0},{"$f":"SB18c!M70","v":0}]
["Infrastructure",null,{"$f":"SUM(C172:C180)","v":14068174},{"$f":"SUM(D172:D180)","v":0},0,0,0,0,668652,668652,14736826,4558000,6412000]
["Community Facilities",null,{"$f":"SB18c!C77","v":549933},{"$f":"SB18c!D77","v":0},{"$f":"SB18c!E77","v":0},{"$f":"SB18c!F77","v":0},{"$f":"SB18c!G77","v":0},{"$f":"SB18c!H77","v":0},{"$f":"SB18c!I77","v":0},{"$f":"SB18c!J77","v":0},{"$f":"SB18c!K77","v":549933},{"$f":"SB18c!L77","v":580000},{"$f":"SB18c!M77","v":612000}]
["Sport and Recreation Facilities",null,{"$f":"SB18c!C100","v":200000},{"$f":"SB18c!D100","v":0},{"$f":"SB18c!E100","v":0},{"$f":"SB18c!F100","v":0},{"$f":"SB18c!G100","v":0},{"$f":"SB18c!H100","v":0},{"$f":"SB18c!I100","v":0},{"$f":"SB18c!J100","v":0},{"$f":"SB18c!K100","v":200000},{"$f":"SB18c!L100","v":211000},{"$f":"SB18c!M100","v":222000}]
["Community Assets",null,{"$f":"SUM(C182:C183)","v":749933},{"$f":"SUM(D182:D183)","v":0},0,0,0,0,0,0,749933,791000,834000]
["Heritage Assets",null,{"$f":"SB18c!C105","v":0},{"$f":"SB18c!D105","v":0},{"$f":"SB18c!E105","v":0},{"$f":"SB18c!F105","v":0},{"$f":"SB18c!G105","v":0},{"$f":"SB18c!H105","v":0},{"$f":"SB18c!I105","v":0},{"$f":"SB18c!J105","v":0},{"$f":"SB18c!K105","v":0},{"$f":"SB18c!L105","v":0},{"$f":"SB18c!M105","v":0}]
["Revenue Generating",null,{"$f":"SB18c!C113","v":0},{"$f":"SB18c!D113","v":0},{"$f":"SB18c!E113","v":0},{"$f":"SB18c!F113","v":0},{"$f":"SB18c!G113","v":0},{"$f":"SB18c!H113","v":0},{"$f":"SB18c!I113","v":0},{"$f":"SB18c!J113","v":0},{"$f":"SB18c!K113","v":0},{"$f":"SB18c!L113","v":0},{"$f":"SB18c!M113","v":0}]
["Non-revenue Generating",null,{"$f":"SB18c!C116","v":0},{"$f":"SB18c!D116","v":0},{"$f":"SB18c!E116","v":0},{"$f":"SB18c!F116","v":0},{"$f":"SB18c!G116","v":0},{"$f":"SB18c!H116","v":0},{"$f":"SB18c!I116","v":0},{"$f":"SB18c!J116","v":0},{"$f":"SB18c!K116","v":0},{"$f":"SB18c!L116","v":0},{"$f":"SB18c!M116","v":0}]
["Investment properties",null,{"$f":"SUM(C186:C187)","v":0},{"$f":"SUM(D186:D187)","v":0},0,0,0,0,0,0,0,0,0]
["Operational Buildings",null,{"$f":"SB18c!C121","v":1765731},{"$f":"SB18c!D121","v":0},{"$f":"SB18c!E121","v":0},{"$f":"SB18c!F121","v":0},{"$f":"SB18c!G121","v":0},{"$f":"SB18c!H121","v":0},{"$f":"SB18c!I121","v":0},{"$f":"SB18c!J121","v":0},{"$f":"SB18c!K121","v":1765731},{"$f":"SB18c!L121","v":863000},{"$f":"SB18c!M121","v":965000}]
["Housing",null,{"$f":"SB18c!C133","v":0},{"$f":"SB18c!D133","v":0},{"$f":"SB18c!E133","v":0},{"$f":"SB18c!F133","v":0},{"$f":"SB18c!G133","v":0},{"$f":"SB18c!H133","v":0},{"$f":"SB18c!I133","v":0},{"$f":"SB18c!J133","v":0},{"$f":"SB18c!K133","v":0},{"$f":"SB18c!L133","v":0},{"$f":"SB18c!M133","v":0}]
["Other Assets",null,{"$f":"SUM(C189:C190)","v":1765731},{"$f":"SUM(D189:D190)","v":0},0,0,0,0,0,0,1765731,863000,965000]
["Biological or Cultivated Assets",null,{"$f":"SB18c!C138","v":0},{"$f":"SB18c!D138","v":0},{"$f":"SB18c!E138","v":0},{"$f":"SB18c!F138","v":0},{"$f":"SB18c!G138","v":0},{"$f":"SB18c!H138","v":0},{"$f":"SB18c!I138","v":0},{"$f":"SB18c!J138","v":0},{"$f":"SB18c!K138","v":0},{"$f":"SB18c!L138","v":0},{"$f":"SB18c!M138","v":0}]
["Servitudes",null,{"$f":"SB18c!C142","v":0},{"$f":"SB18c!D142","v":0},{"$f":"SB18c!E142","v":0},{"$f":"SB18c!F142","v":0},{"$f":"SB18c!G142","v":0},{"$f":"SB18c!H142","v":0},{"$f":"SB18c!I142","v":0},{"$f":"SB18c!J142","v":0},{"$f":"SB18c!K142","v":0},{"$f":"SB18c!L142","v":0},{"$f":"SB18c!M142","v":0}]
["Licences and Rights",null,{"$f":"SB18c!C143","v":0},{"$f":"SB18c!D143","v":0},{"$f":"SB18c!E143","v":0},{"$f":"SB18c!F143","v":0},{"$f":"SB18c!G143","v":0},{"$f":"SB18c!H143","v":0},{"$f":"SB18c!I143","v":0},{"$f":"SB18c!J143","v":0},{"$f":"SB18c!K143","v":0},{"$f":"SB18c!L143","v":0},{"$f":"SB18c!M143","v":0}]
["Intangible Assets",null,{"$f":"SUM(C193:C194)","v":0},{"$f":"SUM(D193:D194)","v":0},0,0,0,0,0,0,0,0,0]
["Computer Equipment",null,{"$f":"SB18c!C151","v":1801663},{"$f":"SB18c!D151","v":0},{"$f":"SB18c!E151","v":0},{"$f":"SB18c!F151","v":0},{"$f":"SB18c!G151","v":0},{"$f":"SB18c!H151","v":0},{"$f":"SB18c!I151","v":0},{"$f":"SB18c!J151","v":0},{"$f":"SB18c!K151","v":1801663},{"$f":"SB18c!L151","v":1899000},{"$f":"SB18c!M151","v":1003000}]
["Furniture and Office Equipment",null,{"$f":"SB18c!C154","v":0},{"$f":"SB18c!D154","v":0},{"$f":"SB18c!E154","v":0},{"$f":"SB18c!F154","v":0},{"$f":"SB18c!G154","v":0},{"$f":"SB18c!H154","v":0},{"$f":"SB18c!I154","v":0},{"$f":"SB18c!J154","v":0},{"$f":"SB18c!K154","v":0},{"$f":"SB18c!L154","v":0},{"$f":"SB18c!M154","v":0}]
["Machinery and Equipment",null,{"$f":"SB18c!C157","v":1100777.1400000011},{"$f":"SB18c!D157","v":0},{"$f":"SB18c!E157","v":0},{"$f":"SB18c!F157","v":0},{"$f":"SB18c!G157","v":0},{"$f":"SB18c!H157","v":0},{"$f":"SB18c!I157","v":0},{"$f":"SB18c!J157","v":0},{"$f":"SB18c!K157","v":1100777.1400000011},{"$f":"SB18c!L157","v":1161000},{"$f":"SB18c!M157","v":1224000}]
["Transport Assets",null,{"$f":"SB18c!C160","v":2612371},{"$f":"SB18c!D160","v":0},{"$f":"SB18c!E160","v":0},{"$f":"SB18c!F160","v":0},{"$f":"SB18c!G160","v":0},{"$f":"SB18c!H160","v":0},{"$f":"SB18c!I160","v":0},{"$f":"SB18c!J160","v":0},{"$f":"SB18c!K160","v":2612371},{"$f":"SB18c!L160","v":2361000},{"$f":"SB18c!M160","v":1905000}]
["Land",null,{"$f":"SB18c!C163","v":0},{"$f":"SB18c!D163","v":0},{"$f":"SB18c!E163","v":0},{"$f":"SB18c!F163","v":0},{"$f":"SB18c!G163","v":0},{"$f":"SB18c!H163","v":0},{"$f":"SB18c!I163","v":0},{"$f":"SB18c!J163","v":0},{"$f":"SB18c!K163","v":0},{"$f":"SB18c!L163","v":0},{"$f":"SB18c!M163","v":0}]
["Zoo's, Marine and Non-biological Animals",6,{"$f":"SB18c!C166","v":0},{"$f":"SB18c!D166","v":0},{"$f":"SB18c!E166","v":0},{"$f":"SB18c!F166","v":0},{"$f":"SB18c!G166","v":0},{"$f":"SB18c!H166","v":0},{"$f":"SB18c!I166","v":0},{"$f":"SB18c!J166","v":0},{"$f":"SB18c!K166","v":0},{"$f":"SB18c!L166","v":0},{"$f":"SB18c!M166","v":0}]
["TOTAL EXPENDITURE OTHER ITEMS to be adjusted",null,{"$f":"+C170+C171","v":27142028.951964002},{"$f":"+D170+D171","v":0},0,0,0,0,1567483.77,1567483.77,28709512.721964002,18498247.683096055,19654489.318206485]
[]
["Renewal and upgrading of Existing Assets as % of total capex",null,{"$f":"IF(ISERROR((C39+C71)/C134),0,((C39+C71)/C134))","v":0.15107132225952266},{"$f":"IF(ISERROR((D39+D71)/D134),0,((D39+D71)/D134))","v":0},null,null,null,null,null,null,{"$f":"IF(ISERROR((K39+K71)/K134),0,((K39+K71)/K134))","v":0.15595646210365061},{"$f":"IF(ISERROR((L39+L71)/L134),0,((L39+L71)/L134))","v":0},{"$f":"IF(ISERROR((M39+M71)/M134),0,((M39+M71)/M134))","v":0}]
["Renewal and upgrading of Existing Assets as % of deprecn\"",null,{"$f":"IF(ISERROR((C39+C71)/C170),0,((C39+C71)/C170))","v":5.3701112249670322},{"$f":"IF(ISERROR((D39+D71)/D170),0,((D39+D71)/D170))","v":0},null,null,null,null,null,null,{"$f":"IF(ISERROR((K39+K71)/K170),0,((K39+K71)/K170))","v":4.5578165917559677},{"$f":"IF(ISERROR((L39+L71)/L170),0,((L39+L71)/L170))","v":0},{"$f":"IF(ISERROR((M39+M71)/M170),0,((M39+M71)/M170))","v":0}]
["R&M as a % of PPE",null,{"$f":"IF(ISERROR(C171/C167),0,(C171/C167))","v":2.5865338558146277E-2},{"$f":"IF(ISERROR(D171/D167),0,(D171/D167))","v":0},null,null,null,null,null,null,{"$f":"IF(ISERROR(K171/K167),0,(K171/K167))","v":2.682428125267616E-2},{"$f":"IF(ISERROR(L171/L167),0,(L171/L167))","v":1.1584007345975712E-2},{"$f":"IF(ISERROR(M171/M167),0,(M171/M167))","v":1.2214646730147057E-2}]
["Renewal and upgrading and R&M as a % of PPE",null,{"$f":"IF(ISERROR((C39+C71+C171)/C167),0,((C39+C71+C171)/C167))","v":5.7565202428659E-2},{"$f":"IF(ISERROR((D39+D71+D171)/D167),0,((D39+D71+D171)/D167))","v":0},null,null,null,null,null,null,{"$f":"IF(ISERROR((K39+K71+K171)/K167),0,((K39+K71+K171)/K167))","v":5.8733891424186335E-2},{"$f":"IF(ISERROR((L39+L71+L171)/L167),0,((L39+L71+L171)/L167))","v":1.1584007345975712E-2},{"$f":"IF(ISERROR((M39+M71+M171)/M167),0,((M39+M71+M171)/M167))","v":1.2214646730147057E-2}]
[]
[{"$f":"head27a","v":"References"}]
["1. Detail of new assets provided in Table SB18a"]
["2. Detail of renewal of existing assets provided in Table SB18b"]
["2a. Detail of upgrading of existing assets provided in Table SB18e"]
["3. Detail of Repairs and Maintenance by Asset Class provided in Table SB18c"]
["4. Must reconcile to total capital expenditure on Budgeted Capital Expenditure"]
["5. Must reconcile to Adjustments Budget Financial Position (written down value)"]
["6. Donated/contributed and assets funded by finance leases to be allocated to the respective category"]
["7. Only complete if a previous adjusted budget has been approved in the same financial year. Reflect most recent adjusted budget."]
["8. Additional cash-backed accumulated funds/unspent funds (MFMA section 18(1)(b) and section 28(2)(e)) identified after the Original Budget approved and after annual financial statements audited (note: only where underspending could not reasonably have been foreseen)"]
["9. Increases of funds approved under MFMA section 31"]
["10. Adjustments approved in accordance with MFMA section 29 "]
["11. Adjustments to transfers from National or Provincial Government"]
["12. Adjusts. = 'Other' Adjustments proposed to be approved; including revenue under-collection (MFMA section 28(2)(a)); additional revenue appropriation on existing programmes (section 28(2))(b); projected savings (section 28(2)(d)); error correction (section 28(2)(f))"]
["13. G = B + C + D + E + F"]
["14. Adjusted Budget H = (A or A1/2 etc) + G"]
[]
[]
[null,"Asset register balance check",{"$f":"SUM('B6-FinPos'!C21:C24)-'B9-Asset'!C167","v":-249045},{"$f":"SUM('B6-FinPos'!D21:D24)-'B9-Asset'!D167","v":0},{"$f":"SUM('B6-FinPos'!E21:E24)-'B9-Asset'!E167","v":0},{"$f":"SUM('B6-FinPos'!F21:F24)-'B9-Asset'!F167","v":0},{"$f":"SUM('B6-FinPos'!G21:G24)-'B9-Asset'!G167","v":0},{"$f":"SUM('B6-FinPos'!H21:H24)-'B9-Asset'!H167","v":0},{"$f":"SUM('B6-FinPos'!I21:I24)-'B9-Asset'!I167","v":310000},{"$f":"SUM('B6-FinPos'!J21:J24)-'B9-Asset'!J167","v":310000},{"$f":"SUM('B6-FinPos'!K21:K24)-'B9-Asset'!K167","v":60955},{"$f":"SUM('B6-FinPos'!L21:L24)-'B9-Asset'!L167","v":77695},{"$f":"SUM('B6-FinPos'!M21:M24)-'B9-Asset'!M167","v":95665.700000047684}]

{"sheet":"B10-SerDel","index":18,"n_rows":99,"n_cols":13,"rows_kept":99,"cut":false,"hidden":false,"merged":[[95,0,95,12],[93,0,93,12],[1,0,4,0],[1,1,4,1],[1,2,1,10],[89,0,89,12],[88,0,88,12],[90,0,90,12],[91,0,91,12]]}
[{"$f":"muni&\" - \"&_ADJ10&\" - \"&Date","v":"LIM332 Greater Letaba - Table B10 Basic service delivery measurement - 27 February 2019"}]
[{"$f":"desc","v":"Description"},{"$f":"head27","v":"Ref"},{"$f":"Head2","v":"Budget Year 2018/19"},null,null,null,null,null,null,null,null,{"$f":"Head10","v":"Budget Year +1 2019/20"},{"$f":"Head11","v":"Budget Year +2 2020/21"}]
[null,null,{"$f":"Head6","v":"Original Budget"},{"$f":"Head54","v":"Prior Adjusted"},{"$f":"Head51","v":"Accum. Funds"},{"$f":"Head52","v":"Multi-year capital"},{"$f":"Head53","v":"Unfore. Unavoid."},{"$f":"Head55","v":"Nat. or Prov. Govt"},{"$f":"Head50","v":"Other Adjusts."},{"$f":"Head56","v":"Total Adjusts."},{"$f":"Head7","v":"Adjusted Budget"},{"$f":"Head7","v":"Adjusted Budget"},{"$f":"Head7","v":"Adjusted Budget"}]
[null,null,null,7,8,9,10,11,12,13,14]
[null,null,"A","A1","B","C","D","E","F","G","H"]
["Household service targets",1]
["Water:"]
["Piped water inside dwelling",null,7948,null,null,null,null,null,null,{"$f":"SUM(E8:I8)","v":0},{"$f":"IF(D8=0,C8+J8,D8+J8)","v":7948},7948,7948]
["Piped water inside yard (but not in dwelling)",null,21320,null,null,null,null,null,null,0,21320,21320,21320]
["Using public tap (at least min.service level)",2,19277,null,null,null,null,null,null,0,19277,19277,19277]
["Other water supply (at least min.service level)",null,null,null,null,null,null,null,null,0,0]
["Minimum Service Level and Above sub-total",null,{"$f":"SUM(C8:C11)","v":48545},0,0,0,0,0,0,0,48545,48545,48545]
["Using public tap (< min.service level)",3,48545,null,null,null,null,null,null,0,48545,48545,48545]
["Other water supply (< min.service level)","3,4",9462,null,null,null,null,null,null,0,9462,9462,9462]
["No water supply",null,9060,null,null,null,null,null,null,0,9060,9060,9060]
["Below Minimum Servic Level sub-total",null,{"$f":"SUM(C13:C15)","v":67067},0,0,0,0,0,0,0,67067,67067,67067]
["Total number of households",5,{"$f":"C12+C16","v":115612},0,0,0,0,0,0,0,115612,115612,115612]
["Sanitation/sewerage:"]
["Flush toilet (connected to sewerage)",null,9003,null,null,null,null,null,null,{"$f":"SUM(E19:I19)","v":0},{"$f":"IF(D19=0,C19+J19,D19+J19)","v":9003},9003,9003]
["Flush toilet (with septic tank)",null,8011,null,null,null,null,null,null,0,8011,8011,8011]
["Chemical toilet",null,12012,null,null,null,null,null,null,0,12012,12012,12012]
["Pit toilet (ventilated)",null,21012,null,null,null,null,null,null,0,21012,21012,21012]
["Other toilet provisions (> min.service level)",null,6008,null,null,null,null,null,null,0,6008,6008,6008]
[{"$f":"$A$12","v":"Minimum Service Level and Above sub-total"},null,{"$f":"SUM(C19:C23)","v":56046},0,0,0,0,0,0,0,56046,56046,56046]
["Bucket toilet",null,1000,null,null,null,null,null,null,0,1000,1000,1000]
["Other toilet provisions (< min.service level)",null,2011,null,null,null,null,null,null,0,2011,2011,2011]
["No toilet provisions",null,8010,null,null,null,null,null,null,0,8010,8010,8010]
[{"$f":"$A$16","v":"Below Minimum Servic Level sub-total"},null,{"$f":"SUM(C25:C27)","v":11021},0,0,0,0,0,0,0,11021,11021,11021]
[{"$f":"$A$17","v":"Total number of households"},{"$f":"$B$17","v":5},{"$f":"C24+C28","v":67067},0,0,0,0,0,0,0,67067,67067,67067]
["Energy:"]
["Electricity (at least min. service level)",null,56260,null,null,null,null,null,null,{"$f":"SUM(E31:I31)","v":0},{"$f":"IF(D31=0,C31+J31,D31+J31)","v":56260},56260,56260]
["Electricity - prepaid (> min.service level)",null,6002,null,null,null,null,null,null,0,6002,6002,6002]
[{"$f":"$A$12","v":"Minimum Service Level and Above sub-total"},null,{"$f":"SUM(C31:C32)","v":62262},0,0,0,0,0,0,0,62262,62262,62262]
["Electricity (< min.service level)",null,0,null,null,null,null,null,null,0,0,0,0]
["Electricity - prepaid (< min. service level)",null,4805,null,null,null,null,null,null,0,4805,4805,4805]
["Other energy sources",null,0,null,null,null,null,null,null,0,0,0,0]
[{"$f":"$A$16","v":"Below Minimum Servic Level sub-total"},null,{"$f":"SUM(C34:C36)","v":4805},0,0,0,0,0,0,0,4805,4805,4805]
[{"$f":"$A$17","v":"Total number of households"},{"$f":"$B$17","v":5},{"$f":"C33+C37","v":67067},0,0,0,0,0,0,0,67067,67067,67067]
["Refuse:"]
["Removed at least once a week (min.service)",null,7454,null,null,null,null,null,null,{"$f":"SUM(E40:I40)","v":0},{"$f":"IF(D40=0,C40+J40,D40+J40)","v":7454},7454,7454]
[{"$f":"$A$12","v":"Minimum Service Level and Above sub-total"},null,{"$f":"SUM(C40)","v":7454},0,0,0,0,0,0,{"$f":"SUM(E41:I41)","v":0},7454,{"$f":"SUM(L40)","v":7454},{"$f":"SUM(M40)","v":7454}]
["Removed less frequently than once a week",null,978,null,null,null,null,null,null,0,978,978,978]
["Using communal refuse dump",null,1051,null,null,null,null,null,null,0,1051,1051,1051]
["Using own refuse dump",null,45815,null,null,null,null,null,null,0,45815,45815,45815]
["Other rubbish disposal",null,10554,null,null,null,null,null,null,0,10554,10554,10554]
["No rubbish disposal",null,1215,null,null,null,null,null,null,0,1215,1215,1215]
[{"$f":"$A$16","v":"Below Minimum Servic Level sub-total"},null,{"$f":"SUM(C42:C46)","v":59613},0,0,0,0,0,0,0,59613,59613,59613]
[{"$f":"$A$17","v":"Total number of households"},{"$f":"$B$17","v":5},{"$f":"C41+C47","v":67067},0,0,0,0,0,0,{"$f":"J40+J47","v":0},{"$f":"K40+K47","v":67067},{"$f":"L41+L47","v":67067},{"$f":"M41+M47","v":67067}]
[]
["Households receiving Free Basic Service",15]
["Water (6 kilolitres per household per month)",null,{"$f":"'SB5'!E263","v":120},{"$f":"'SB5'!F263","v":0},{"$f":"'SB5'!G263","v":0},{"$f":"'SB5'!H263","v":0},{"$f":"'SB5'!I263","v":0},{"$f":"'SB5'!J263","v":0},{"$f":"'SB5'!K263","v":0},{"$f":"SUM(E51:I51)","v":0},{"$f":"IF(D51=0,C51+J51,D51+J51)","v":120},{"$f":"'SB5'!N263","v":120},{"$f":"'SB5'!O263","v":120}]
["Sanitation (free minimum level service)",null,{"$f":"'SB5'!E275","v":120},{"$f":"'SB5'!F275","v":0},{"$f":"'SB5'!G275","v":0},{"$f":"'SB5'!H275","v":0},{"$f":"'SB5'!I275","v":0},{"$f":"'SB5'!J275","v":0},{"$f":"'SB5'!K275","v":0},{"$f":"SUM(E52:I52)","v":0},{"$f":"IF(D52=0,C52+J52,D52+J52)","v":120},{"$f":"'SB5'!N275","v":120},{"$f":"'SB5'!O275","v":120}]
["Electricity/other energy (50kwh per household per month)",null,{"$f":"'SB5'!E251","v":0},{"$f":"'SB5'!F251","v":0},{"$f":"'SB5'!G251","v":0},{"$f":"'SB5'!H251","v":0},{"$f":"'SB5'!I251","v":0},{"$f":"'SB5'!J251","v":0},{"$f":"'SB5'!K251","v":0},{"$f":"SUM(E53:I53)","v":0},{"$f":"IF(D53=0,C53+J53,D53+J53)","v":0},{"$f":"'SB5'!N251","v":0},{"$f":"'SB5'!O251","v":0}]
["Refuse (removed at least once a week)",null,{"$f":"'SB5'!E287","v":120},{"$f":"'SB5'!F287","v":0},{"$f":"'SB5'!G287","v":0},{"$f":"'SB5'!H287","v":0},{"$f":"'SB5'!I287","v":0},{"$f":"'SB5'!J287","v":0},{"$f":"'SB5'!K287","v":0},{"$f":"SUM(E54:I54)","v":0},{"$f":"IF(D54=0,C54+J54,D54+J54)","v":120},{"$f":"'SB5'!N287","v":120},{"$f":"'SB5'!O287","v":120}]
[]
["Cost of Free Basic Services provided (R'000)",16," "]
["Water (6 kilolitres per indigent household per month)",null,{"$f":"'SB1'!C21","v":0},{"$f":"'SB1'!D21","v":0},{"$f":"'SB1'!E21","v":0},{"$f":"'SB1'!F21","v":0},{"$f":"'SB1'!G21","v":0},{"$f":"'SB1'!H21","v":0},{"$f":"'SB1'!I21","v":0},{"$f":"SUM(E57:I57)","v":0},{"$f":"IF(D57=0,C57+J57,D57+J57)","v":0},{"$f":"'SB1'!L21","v":0},{"$f":"'SB1'!M21","v":0}]
["Sanitation (free sanitation service to indigent households)",null,{"$f":"'SB1'!C27","v":0},{"$f":"'SB1'!D27","v":0},{"$f":"'SB1'!E27","v":0},{"$f":"'SB1'!F27","v":0},{"$f":"'SB1'!G27","v":0},{"$f":"'SB1'!H27","v":0},{"$f":"'SB1'!I27","v":0},{"$f":"SUM(E58:I58)","v":0},{"$f":"IF(D58=0,C58+J58,D58+J58)","v":0},{"$f":"'SB1'!L27","v":0},{"$f":"'SB1'!M27","v":0}]
["Electricity/other energy (50kwh per indigent household per month)",null,{"$f":"'SB1'!C15","v":8000},{"$f":"'SB1'!D15","v":0},{"$f":"'SB1'!E15","v":0},{"$f":"'SB1'!F15","v":0},{"$f":"'SB1'!G15","v":0},{"$f":"'SB1'!H15","v":0},{"$f":"'SB1'!I15","v":0},{"$f":"SUM(E59:I59)","v":0},{"$f":"IF(D59=0,C59+J59,D59+J59)","v":8000},{"$f":"'SB1'!L15","v":8000},{"$f":"'SB1'!M15","v":8000}]
["Refuse (removed once a week for indigent households)",null,{"$f":"'SB1'!C34","v":0},{"$f":"'SB1'!D34","v":0},{"$f":"'SB1'!E34","v":0},{"$f":"'SB1'!F34","v":0},{"$f":"'SB1'!G34","v":0},{"$f":"'SB1'!H34","v":0},{"$f":"'SB1'!I34","v":0},{"$f":"SUM(E60:I60)","v":0},{"$f":"IF(D60=0,C60+J60,D60+J60)","v":0},{"$f":"'SB1'!L34","v":0},{"$f":"'SB1'!M34","v":0}]
["Cost of Free Basic Services provided - Informal Formal Settlements (R'000)",null,{"$f":"'SB5'!E260+'SB5'!E272+'SB5'!E284+'SB5'!E296","v":0},{"$f":"'SB5'!F260+'SB5'!F272+'SB5'!F284+'SB5'!F296","v":0},{"$f":"'SB5'!G260+'SB5'!G272+'SB5'!G284+'SB5'!G296","v":0},{"$f":"'SB5'!H260+'SB5'!H272+'SB5'!H284+'SB5'!H296","v":0},{"$f":"'SB5'!I260+'SB5'!I272+'SB5'!I284+'SB5'!I296","v":0},{"$f":"'SB5'!J260+'SB5'!J272+'SB5'!J284+'SB5'!J296","v":0},{"$f":"'SB5'!K260+'SB5'!K272+'SB5'!K284+'SB5'!K296","v":0},{"$f":"SUM(E61:I61)","v":0},{"$f":"IF(D61=0,C61+J61,D61+J61)","v":0},{"$f":"'SB5'!N260+'SB5'!N272+'SB5'!N284+'SB5'!N296","v":0},{"$f":"'SB5'!O260+'SB5'!O272+'SB5'!O284+'SB5'!O296","v":0}]
["Total cost of FBS provided  ",null,{"$f":"SUM(C57:C61)","v":8000},{"$f":"SUM(D57:D61)","v":0},0,0,0,0,0,0,8000,8000,8000]
[]
["Highest level of free service provided"]
["Property rates (R'000 value threshold)",null,null,null,null,null,null,null,0,{"$f":"SUM(E65:I65)","v":0},{"$f":"IF(D65=0,C65+J65,D65+J65)","v":0}]
["Water (kilolitres per household per month)",null,3759.6,null,null,null,null,null,0,0,3759.6,3759.6,3759.6]
["Sanitation (kilolitres per household per month)",null,null,null,null,null,null,null,0,0,0]
["Sanitation (Rand per household per month)",null,24051.600000000002,null,null,null,null,null,0,0,24051.600000000002,24051.600000000002,24051.600000000002]
["Electricity (kw per household per month)",null,412400,null,null,null,null,null,0,0,412400,412400,412400]
["Refuse (average litres per week)",null,null,null,null,null,null,null,null,0,0]
["Revenue cost of free services provided (R'000)",17]
["Property rates (tariff adjustment) ( impermissable values per section 17 of MPRA)",null,3239430.07,null,null,null,null,null,0,{"$f":"SUM(E72:I72)","v":0},{"$f":"IF(D72=0,C72+J72,D72+J72)","v":3239430.07},3239430.07,3239430.07]
["Property rates  exemptions, reductions and rebates and impermissable values in excess of section 17 of MPRA)",null,{"$f":"'SB1'!C9","v":3239430.07},{"$f":"'SB1'!D9","v":0},{"$f":"'SB1'!E9","v":0},{"$f":"'SB1'!F9","v":0},{"$f":"'SB1'!G9","v":0},{"$f":"'SB1'!H9","v":0},{"$f":"'SB1'!I9","v":0},0,3239430.07,{"$f":"'SB1'!L9","v":3449992},{"$f":"'SB1'!M9","v":3674242}]
["Water (in excess of 6 kilolitres per indigent household per month)",null,{"$f":"'SB1'!C20","v":0},{"$f":"'SB1'!D20","v":0},{"$f":"'SB1'!E20","v":0},{"$f":"'SB1'!F20","v":0},{"$f":"'SB1'!G20","v":0},{"$f":"'SB1'!H20","v":0},{"$f":"'SB1'!I20","v":0},0,0,{"$f":"'SB1'!L20","v":0},{"$f":"'SB1'!M20","v":0}]
["Sanitation (in excess of free sanitation service to indigent households)",null,{"$f":"'SB1'!C26","v":0},{"$f":"'SB1'!D26","v":0},{"$f":"'SB1'!E26","v":0},{"$f":"'SB1'!F26","v":0},{"$f":"'SB1'!G26","v":0},{"$f":"'SB1'!H26","v":0},{"$f":"'SB1'!I26","v":0},0,0,{"$f":"'SB1'!L26","v":0},{"$f":"'SB1'!M26","v":0}]
["Electricity/other energy (in excess of 50 kwh per indigent household per month)",null,{"$f":"'SB1'!C14","v":4220837.8099999996},{"$f":"'SB1'!D14","v":0},{"$f":"'SB1'!E14","v":0},{"$f":"'SB1'!F14","v":0},{"$f":"'SB1'!G14","v":0},{"$f":"'SB1'!H14","v":0},{"$f":"'SB1'!I14","v":0},0,4220837.8099999996,{"$f":"'SB1'!L14","v":4495192},{"$f":"'SB1'!M14","v":4787379}]
["Refuse (in excess of one removal a week for indigent households)",null,{"$f":"'SB1'!C33","v":491829.53},{"$f":"'SB1'!D33","v":0},{"$f":"'SB1'!E33","v":0},{"$f":"'SB1'!F33","v":0},{"$f":"'SB1'!G33","v":0},{"$f":"'SB1'!H33","v":0},{"$f":"'SB1'!I33","v":0},0,491829.53,{"$f":"'SB1'!L33","v":523798},{"$f":"'SB1'!M33","v":557845}]
["Municipal Housing - rental rebates",null,null,null,null,null,null,null,null,0,0]
["Housing - top structure subsidies",6,null,null,null,null,null,null,null,0,0]
["Other",null,null,null,null,null,null,null,null,0,0]
["Total revenue cost of subsidised services provided ",null,{"$f":"SUM(C72:C80)","v":11191527.479999999},0,0,0,0,0,0,0,11191527.479999999,11708412.07,12258896.07]
[{"$f":"head27a","v":"References"}]
["1. Include services provided by another entity; e.g. Eskom"]
["2. Stand distance > 200m from dwelling"]
["3. Stand distance <= 200m from dwelling"]
["4. Borehole, spring, rain-water tank etc."]
["5. Must agree to total number of households in municipal area"]
["6. Include value of subsidy provided by municipality above provincial subsidy level"]
["7. Only complete if a previous adjusted budget has been approved in the same financial year. Reflect most recent adjusted budget."]
["8. Additional cash-backed accumulated funds/unspent funds (MFMA section 18(1)(b) and section 28(2)(e)) identified after the Original Budget approved and after annual financial statements audited (note: only where underspending could not reasonably have been foreseen)"]
["9. Increases of funds approved under MFMA section 31"]
["10. Adjustments approved in accordance with MFMA section 29 "]
["11. Adjustments to transfers from National or Provincial Government"]
["12. Adjusts. = 'Other' Adjustments proposed to be approved; including revenue under-collection (MFMA section 28(2)(a)); additional revenue appropriation on existing programmes (section 28(2))(b); projected savings (section 28(2)(d)); error correction (section 28(2)(f))"]
["13. G = B + C + D + E + F"]
["14. Adjusted Budget H = (A or A1/2 etc) + G"]
["15. Show number of households receiving at least these levels of services completely free"]
["16. Must reflect the cost to the municipality of providing the Free Basic Service"]
["17. Reflect the cost to the municipality in terms of 'revenue foregone' of providing free services (note this will not equal 'Revenue Foregone' on SA1)"]

{"sheet":"SB1","index":19,"n_rows":181,"n_cols":13,"rows_kept":181,"cut":false,"hidden":false,"merged":[[176,0,176,12],[172,0,172,12],[1,0,3,0],[1,1,3,1],[1,2,1,10]]}
[{"$f":"muni&\" - \"&ADJB1&\" - \"&Date","v":"LIM332 Greater Letaba - Supporting Table SB1 Supporting detail to 'Budgeted Financial Performance' - 27 February 2019"}]
[{"$f":"desc","v":"Description"},{"$f":"head27","v":"Ref"},{"$f":"Head2","v":"Budget Year 2018/19"},null,null,null,null,null,null,null,null,{"$f":"Head10","v":"Budget Year +1 2019/20"},{"$f":"Head11","v":"Budget Year +2 2020/21"}]
[null,null,{"$f":"Head6","v":"Original Budget"},{"$f":"Head54","v":"Prior Adjusted"},{"$f":"Head51","v":"Accum. Funds"},{"$f":"Head52","v":"Multi-year capital"},{"$f":"Head53","v":"Unfore. Unavoid."},{"$f":"Head55","v":"Nat. or Prov. Govt"},{"$f":"Head50","v":"Other Adjusts."},{"$f":"Head56","v":"Total Adjusts."},{"$f":"Head7","v":"Adjusted Budget"},{"$f":"Head7","v":"Adjusted Budget"},{"$f":"Head7","v":"Adjusted Budget"}]
[null,null,null,6,7,8,9,10,11,12,13]
["R thousands",null,"A","A1","B","C","D","E","F","G","H"]
["REVENUE ITEMS"]
["Property rates"]
["Total Property Rates",null,15494757.640000001,null,null,null,null,null,{"$f":"3607959+1000000","v":4607959},{"$f":"SUM(E8:I8)","v":4607959},{"$f":"IF(D8=0,C8+J8,D8+J8)","v":20102716.640000001},20344393,21666779]
["less Revenue Foregone (exemptions, reductions and rebates and impermissable values in excess of section 17 of MPRA)",null,3239430.07,null,null,null,null,null,null,{"$f":"SUM(E9:I9)","v":0},{"$f":"IF(D9=0,C9+J9,D9+J9)","v":3239430.07},3449992,3674242]
["Net Property Rates",null,{"$f":"C8-C9","v":12255327.57},{"$f":"D8-D9","v":0},0,0,0,0,4607959,4607959,16863286.57,16894401,17992537]
[]
["Service charges - electricity revenue"]
["Total Service charges - electricity revenue",null,16887481.02,null,null,null,null,null,{"$f":"9800000+2000000+8000","v":11808000},{"$f":"SUM(E13:I13)","v":11808000},{"$f":"IF(D13=0,C13+J13,D13+J13)","v":28695481.02},{"$f":"28422167+8000","v":28430167},{"$f":"30269608+8000","v":30277608}]
["less Revenue Foregone (in excess of 50 kwh per indigent household per month)",null,4220837.8099999996,null,null,null,null,null,0,{"$f":"SUM(E14:I14)","v":0},{"$f":"IF(D14=0,C14+J14,D14+J14)","v":4220837.8099999996},4495192,4787379]
["less Cost of Free Basis Services (50 kwh per indigent household per month)",null,{"$f":"'SB5'!E250","v":8000},{"$f":"'SB5'!F250","v":0},{"$f":"'SB5'!G250","v":0},{"$f":"'SB5'!H250","v":0},{"$f":"'SB5'!I250","v":0},{"$f":"'SB5'!J250","v":0},{"$f":"'SB5'!K250","v":0},{"$f":"SUM(E15:I15)","v":0},{"$f":"IF(D15=0,C15+J15,D15+J15)","v":8000},{"$f":"'SB5'!N250","v":8000},{"$f":"'SB5'!O250","v":8000}]
["Net Service charges - electricity revenue",null,{"$f":"C13-C14-C15","v":12658643.210000001},{"$f":"D13-D14-D15","v":0},0,0,0,0,11808000,11808000,24466643.210000001,23926975,25482229]
[]
["Service charges - water revenue"]
["Total Service charges - water revenue",null,null,null,null,null,null,null,null,{"$f":"SUM(E19:I19)","v":0},{"$f":"IF(D19=0,C19+J19,D19+J19)","v":0}]
["less Revenue Foregone (in excess of 6 kilolitres per indigent household per month)",null,null,null,null,null,null,null,null,{"$f":"SUM(E20:I20)","v":0},{"$f":"IF(D20=0,C20+J20,D20+J20)","v":0}]
["less Cost of Free Basis Services (6 kilolitres per indigent household per month)",null,{"$f":"'SB5'!E262","v":0},{"$f":"'SB5'!F262","v":0},{"$f":"'SB5'!G262","v":0},{"$f":"'SB5'!H262","v":0},{"$f":"'SB5'!I262","v":0},{"$f":"'SB5'!J262","v":0},{"$f":"'SB5'!K262","v":0},{"$f":"SUM(E21:I21)","v":0},{"$f":"IF(D21=0,C21+J21,D21+J21)","v":0},{"$f":"'SB5'!N262","v":0},{"$f":"'SB5'!O262","v":0}]
["Net Service charges - water revenue",null,{"$f":"C19-C20-C21","v":0},{"$f":"D19-D20-D21","v":0},0,0,0,0,0,{"$f":"J19-J20-J21","v":0},0,0,0]
[]
["Service charges - sanitation revenue"]
["Total Service charges - sanitation revenue",null,null,null,null,null,null,null,null,{"$f":"SUM(E25:I25)","v":0},{"$f":"IF(D25=0,C25+J25,D25+J25)","v":0}]
["less Revenue Foregone (in excess of free sanitation service to indigent households)",null,null,null,null,null,null,null,null,{"$f":"SUM(E26:I26)","v":0},{"$f":"IF(D26=0,C26+J26,D26+J26)","v":0}]
["less Cost of Free Basis Services (free sanitation service to indigent households)",null,{"$f":"'SB5'!E274","v":0},{"$f":"'SB5'!F274","v":0},{"$f":"'SB5'!G274","v":0},{"$f":"'SB5'!H274","v":0},{"$f":"'SB5'!I274","v":0},{"$f":"'SB5'!J274","v":0},{"$f":"'SB5'!K274","v":0},{"$f":"SUM(E27:I27)","v":0},{"$f":"IF(D27=0,C27+J27,D27+J27)","v":0},{"$f":"'SB5'!N274","v":0},{"$f":"'SB5'!O274","v":0}]
["Net Service charges - sanitation revenue",null,{"$f":"C25-C26-C27","v":0},{"$f":"D25-D26-D27","v":0},0,0,0,0,0,0,0,0,0]
[null,null,"."]
["Service charges - refuse revenue"]
["Total refuse removal revenue",null,6735226.3499999996,null,null,null,null,null,{"$f":"1000000+1000000","v":2000000},{"$f":"SUM(E31:I31)","v":2000000},{"$f":"IF(D31=0,C31+J31,D31+J31)","v":8735226.3499999996},8238016,8773487]
["Total landfill revenue",null,null,null,null,null,null,null,null,{"$f":"SUM(E32:I32)","v":0},{"$f":"IF(D32=0,C32+J32,D32+J32)","v":0}]
["less Revenue Foregone (in excess of one removal a week to indigent households)",null,491829.53,null,null,null,null,null,null,{"$f":"SUM(E33:I33)","v":0},{"$f":"IF(D33=0,C33+J33,D33+J33)","v":491829.53},523798,557845]
["less Cost of Free Basis Services  (removed once a week to indigent households)",null,{"$f":"'SB5'!E286","v":0},{"$f":"'SB5'!F286","v":0},{"$f":"'SB5'!G286","v":0},{"$f":"'SB5'!H286","v":0},{"$f":"'SB5'!I286","v":0},{"$f":"'SB5'!J286","v":0},{"$f":"'SB5'!K286","v":0},{"$f":"SUM(E34:I34)","v":0},{"$f":"IF(D34=0,C34+J34,D34+J34)","v":0},{"$f":"'SB5'!N286","v":0},{"$f":"'SB5'!O286","v":0}]
["Net Service charges - refuse revenue",null,{"$f":"SUM(C31:C32)-SUM(C33:C34)","v":6243396.8199999994},{"$f":"SUM(D31:D32)-SUM(D33:D34)","v":0},0,0,0,0,2000000,2000000,8243396.8199999994,7714218,8215642]
[]
["Other Revenue By Source"]
["Prepaid Electricity",null,158314.26,null,null,null,null,null,{"$f":"1822986+800000","v":2622986},{"$f":"SUM(E38:I38)","v":2622986},{"$f":"IF(D38=0,C38+J38,D38+J38)","v":2781300.26},2110085,2247240]
["Interest FNB",null,3602066.89,null,null,null,null,null,0,0,3602066.89,3836201,4085554]
["Sale of Tender documents",null,1376799.43,null,null,null,null,null,0,0,1376799.43,1466291,1561600]
["Other revenue",null,1058402.1000000001,null,null,null,null,null,0,0,1058402.1000000001,1127198,{"$f":"1200466","v":1200466}]
["Investment witdrawals",null,23390000,null,null,null,null,null,0,0,23390000,0,0]
["Income: Awards",null,0,null,null,null,null,null,null,0,0]
["Debt collection services",null,2000000,null,null,null,null,null,0,0,2000000,2130000,2268450]
["Revenue from outdoor adverts",null,1200000,null,null,null,null,null,0,0,1200000,0,0]
["Ga-Kgapane Ext 5 loan accounts",null,2000000,null,null,null,null,null,null,0,2000000,2130000,2268450]
[null,null,null,null,null,null,null,null,null,0,0]
[null,null,null,null,null,null,null,null,null,0,0]
[null,null,null,null,null,null,null,null,null,0,0]
["Total 'Other' Revenue",1,{"$f":"SUM(C38:C49)","v":34785582.68},{"$f":"SUM(D38:D49)","v":0},0,0,0,0,2622986,2622986,37408568.68,12799775,13631760]
[]
["EXPENDITURE ITEMS"]
["Employee related costs"]
["Basic Salaries and Wages",null,49033296.490000002,null,null,null,null,null,14045852,{"$f":"SUM(E54:I54)","v":14045852},{"$f":"IF(D54=0,C54+J54,D54+J54)","v":63079148.490000002},67286216,71561857]
["Pension and UIF Contributions",null,9941819.1400000006,null,null,null,null,null,1022102,1022102,10963921.140000001,11664728,12403511]
["Medical Aid Contributions",null,3788001.87,null,null,null,null,null,527788,527788,4315789.87,4582926,4869851]
["Overtime",null,2767431.78,null,null,null,null,null,1135322,1135322,3902753.78,4160938,4429124]
["Performance Bonus",null,4651085.8099999996,null,null,null,null,null,-880346,-880346,3770739.8099999996,4029375,4289044]
["Motor Vehicle Allowance",null,4658216.47,null,null,null,null,null,515137,{"$f":"SUM(E59:I59)","v":515137},{"$f":"IF(D59=0,C59+J59,D59+J59)","v":5173353.47},5496458,5850722]
["Cellphone Allowance",null,0,null,null,null,null,null,null,{"$f":"SUM(E60:I60)","v":0},{"$f":"IF(D60=0,C60+J60,D60+J60)","v":0}]
["Housing Allowances",null,494732.71,null,null,null,null,null,222834,{"$f":"SUM(E61:I61)","v":222834},{"$f":"IF(D61=0,C61+J61,D61+J61)","v":717566.71},764559,814081]
["Other benefits and allowances",null,{"$f":"382582.41+25671.73+304149.52+164025.39","v":876429.04999999993},null,null,null,null,null,{"$f":"174670+5274+67641+30974","v":278559},278559,1154988.0499999998,{"$f":"593201+32937+395957+207675","v":1229770},{"$f":"631650+35069+421694+221173","v":1309586}]
["Payments in lieu of leave",null,2092783.93,null,null,null,null,null,95247,95247,2188030.9299999997,2329912,2481030]
["Long service awards",null,0,null,null,null,null,null,null,0,0]
["Post-retirement benefit obligations",4,0,null,null,null,null,null,null,0,0]
["sub-total",null,{"$f":"SUM(C54:C65)","v":78303797.25},{"$f":"SUM(D54:D65)","v":0},0,0,0,0,16962495,16962495,95266292.25,101544882,108008806]
["Less: Employees costs capitalised to PPE",null,null,null,null,null,null,null,null,{"$f":"SUM(E67:I67)","v":0},{"$f":"IF(D67=0,C67+J67,D67+J67)","v":0}]
[{"$f":"\"Total \"&A53","v":"Total Employee related costs"},1,{"$f":"C66-C67","v":78303797.25},{"$f":"D66-D67","v":0},0,0,0,0,16962495,{"$f":"SUM(J66:J67)","v":16962495},{"$f":"SUM(K66:K67)","v":95266292.25},{"$f":"L66-L67","v":101544882},{"$f":"M66-M67","v":108008806}]
[]
["Contributions recognised - capital"]
["List contributions by contract",null,null,null,null,null,null,null,null,{"$f":"SUM(E71:I71)","v":0},{"$f":"IF(D71=0,C71+J71,D71+J71)","v":0}]
[null,null,null,null,null,null,null,null,null,0,0]
[null,null,null,null,null,null,null,null,null,0,0]
[null,null,null,null,null,null,null,null,null,0,0]
[null,null,null,null,null,null,null,null,null,0,0]
[null,null,null,null,null,null,null,null,null,0,0]
[{"$f":"\"Total \"&A70","v":"Total Contributions recognised - capital"},null,{"$f":"SUM(C71:C76)","v":0},{"$f":"SUM(D71:D76)","v":0},{"$f":"SUM(E71:E76)","v":0},{"$f":"SUM(F71:F76)","v":0},0,0,0,0,0,0,0]
[]
["Depreciation & asset impairment"]
["Depreciation of Property, Plant & Equipment",null,5043379.8099999996,null,null,null,null,null,898831,{"$f":"SUM(E80:I80)","v":898831},{"$f":"IF(D80=0,C80+J80,D80+J80)","v":5942210.8099999996},6865248,7311489]
["Lease amortisation",null,null,null,null,null,null,null,null,{"$f":"SUM(E81:I81)","v":0},{"$f":"IF(D81=0,C81+J81,D81+J81)","v":0}]
["Capital asset impairment",null,null,null,null,null,null,null,null,{"$f":"SUM(E82:I82)","v":0},{"$f":"IF(D82=0,C82+J82,D82+J82)","v":0}]
["Depreciation resulting from revaluation of PPE",null,null,null,null,null,null,null,null,{"$f":"SUM(E83:I83)","v":0},{"$f":"IF(D83=0,C83+J83,D83+J83)","v":0}]
[{"$f":"\"Total \"&LEFT(A79,35)","v":"Total Depreciation & asset impairment"},1,{"$f":"SUM(C80:C82)-C83","v":5043379.8099999996},{"$f":"SUM(D80:D82)-D83","v":0},0,0,0,0,898831,898831,5942210.8099999996,6865248,7311489]
[]
["Bulk purchases"]
["Electricity Bulk Purchases",null,17096559,null,null,null,null,null,0,{"$f":"SUM(E87:I87)","v":0},{"$f":"IF(D87=0,C87+J87,D87+J87)","v":17096559},18207835,19391344]
["Water Bulk Purchases",null,null,null,null,null,null,null,null,{"$f":"SUM(E88:I88)","v":0},{"$f":"IF(D88=0,C88+J88,D88+J88)","v":0}]
["Total bulk purchases",1,{"$f":"SUM(C87:C88)","v":17096559},0,0,0,0,0,0,0,17096559,18207835,19391344]
[]
["Transfers and grants"]
["Cash transfers and grants",null,null,null,null,null,null,null,null,{"$f":"SUM(E92:I92)","v":0},{"$f":"IF(D92=0,C92+J92,D92+J92)","v":0}]
["Non-cash transfers and grants",null,null,null,null,null,null,null,null,{"$f":"SUM(E93:I93)","v":0},{"$f":"IF(D93=0,C93+J93,D93+J93)","v":0}]
["Total transfers and grants",null,{"$f":"SUM(C92:C93)","v":0},0,0,0,0,0,0,{"$f":"SUM(J92:J93)","v":0},{"$f":"SUM(K92:K93)","v":0},{"$f":"SUM(L92:L93)","v":0},{"$f":"SUM(M92:M93)","v":0}]
[]
["Contracted services"]
["Security services",null,{"$f":"8470325.4714-400000-705300","v":7365025.4714000002},null,null,null,null,null,4257029,{"$f":"SUM(E97:I97)","v":4257029},{"$f":"IF(D97=0,C97+J97,D97+J97)","v":11622054.4714},20635616,21976931]
["Operating lease",null,2638500,null,null,null,null,null,null,0,2638500]
["Meter readings",null,400000,null,null,null,null,null,null,0,400000]
["Refuse removal",null,1605011.031,null,null,null,null,null,null,0,1605011.031]
["Valuation services",null,0,null,null,null,null,null,null,0,0]
["Unbundling of assets",null,1500000,null,null,null,null,null,null,0,1500000]
["Annual Financial Statements",null,800000,null,null,null,null,null,null,0,800000]
["Banking Services",null,105300,null,null,null,null,null,null,0,105300]
["Accounts printing services",null,250000,null,null,null,null,null,null,0,250000]
["Debt collection services",null,100000,null,null,null,null,null,null,0,100000]
["Easy Pay services",null,250000,null,null,null,null,null,null,0,250000]
["Temporary Workers",null,105300,null,null,null,null,null,null,0,105300]
["Other contractors",null,0,null,null,null,null,null,null,0,0]
["Specialist services",null,0,null,null,null,null,null,null,0,0]
[null,null,null,null,null,null,null,null,null,0,0]
[null,null,null,null,null,null,null,null,null,0,0]
[null,null,null,null,null,null,null,null,null,0,0]
[null,null,null,null,null,null,null,null,null,0,0]
[null,null,null,null,null,null,null,null,null,0,0]
[null,null,null,null,null,null,null,null,null,0,0]
[null,null,null,null,null,null,null,null,null,0,0]
[null,null,null,null,null,null,null,null,null,0,0]
[null,null,null,null,null,null,null,null,null,0,0]
[null,null,null,null,null,null,null,null,null,{"$f":"SUM(E120:I120)","v":0},{"$f":"IF(D120=0,C120+J120,D120+J120)","v":0}]
[null,null,null,null,null,null,null,null,null,{"$f":"SUM(E121:I121)","v":0},{"$f":"IF(D121=0,C121+J121,D121+J121)","v":0}]
["sub-total",1,{"$f":"SUM(C97:C121)","v":15119136.5024},{"$f":"SUM(D97:D121)","v":0},{"$f":"SUM(E97:E121)","v":0},{"$f":"SUM(F97:F121)","v":0},0,0,4257029,4257029,19376165.5024,20635616,21976931]
["Allocations to organs of state:"]
["Electricity",null,null,null,null,null,null,null,null,{"$f":"SUM(E124:I124)","v":0},{"$f":"IF(D124=0,C124+J124,D124+J124)","v":0}]
["Water",null,null,null,null,null,null,null,null,{"$f":"SUM(E125:I125)","v":0},{"$f":"IF(D125=0,C125+J125,D125+J125)","v":0}]
["Sanitation",null,null,null,null,null,null,null,null,{"$f":"SUM(E126:I126)","v":0},{"$f":"IF(D126=0,C126+J126,D126+J126)","v":0}]
["Other",null,null,null,null,null,null,null,null,{"$f":"SUM(E127:I127)","v":0},{"$f":"IF(D127=0,C127+J127,D127+J127)","v":0}]
["Total contracted services??",null,{"$f":"SUM(C122:C127)","v":15119136.5024},{"$f":"SUM(D122:D127)","v":0},0,0,0,0,4257029,4257029,19376165.5024,20635616,21976931]
[]
["Other Expenditure By Type"]
["Collection costs",null,0,null,null,null,null,null,0,{"$f":"SUM(E131:I131)","v":0},{"$f":"IF(D131=0,C131+J131,D131+J131)","v":0},0,0]
["Contributions to 'other' provisions",null,0,null,null,null,null,null,0,{"$f":"SUM(E132:I132)","v":0},{"$f":"IF(D132=0,C132+J132,D132+J132)","v":0},0,0]
["Consultant fees",null,0,null,null,null,null,null,0,{"$f":"SUM(E133:I133)","v":0},{"$f":"IF(D133=0,C133+J133,D133+J133)","v":0},0,0]
["Audit fees",null,4742067.26,null,null,null,null,null,0,{"$f":"SUM(E134:I134)","v":0},{"$f":"IF(D134=0,C134+J134,D134+J134)","v":4742067.26},5050301.6319000004,5378571.2379735]
["General expenses","3,5",{"$f":"51874090+138478.96","v":52012568.960000001},null,null,null,null,null,{"$f":"28831920+47000","v":28878920},{"$f":"SUM(E135:I135)","v":28878920},{"$f":"IF(D135=0,C135+J135,D135+J135)","v":80891488.960000008},{"$f":"114961207-6820000-15688000","v":92453207},{"$f":"114961207-16545000","v":98416207}]
[" Ward Committee Meetings & Workshops",null,3910052.25,null,null,null,null,null,-300000,{"$f":"SUM(E136:I136)","v":-300000},{"$f":"IF(D136=0,C136+J136,D136+J136)","v":3610052.25},3844705.6462500002,4094611.5132562499]
[" Bursary Scheme",null,2234676,null,null,null,null,null,-600000,-600000,1634676,2355348.5040000002,2484892.67172]
[" Internship Program (Finance)",null,2145000,null,null,null,null,null,0,0,2145000,2145000,2145000]
["Imbizos",null,400000,0,null,null,null,null,0,0,400000,426000,453690]
["Public Participation",null,500000,null,null,null,null,null,952350.7,952350.7,1452350.7,1546753.4954999997,1647292.4727074995]
[" Repair and maintenance",null,17098649.140000001,null,null,null,null,null,{"$f":"-6131347+8000000+2000000-3200000","v":668653},668653,17767302.140000001]
["Mayor Excellence Award",null,400000,null,null,null,null,null,-100000,-100000,300000,319500,340267.5]
[null,null,null,null,null,null,null,null,null,0,0]
[null,null,null,null,null,null,null,null,null,0,0]
[null,null,null,null,null,null,null,null,null,0,0]
[null,null,null,null,null,null,null,null,null,0,0]
[null,null,null,null,null,null,null,null,null,0,0]
[null,null,null,null,null,null,null,null,null,0,0]
[null,null,null,null,null,null,null,null,null,0,0]
[null,null,null,null,null,null,null,null,null,0,0]
[null,null,null,null,null,null,null,null,null,0,0]
[null,null,null,null,null,null,null,null,null,0,0]
[null,null,null,null,null,null,null,null,null,0,0]
[null,null,null,null,null,null,null,null,null,0,0]
[null,null,null,null,null,null,null,null,null,0,0]
[null,null,null,null,null,null,null,null,null,0,0]
[null,null,null,null,null,null,null,null,null,0,0]
["Total Other Expenditure",1,{"$f":"SUM(C131:C157)","v":83443013.609999999},{"$f":"SUM(D131:D157)","v":0},{"$f":"SUM(E131:E157)","v":0},{"$f":"SUM(F131:F157)","v":0},0,0,29499923.699999999,29499923.699999999,112942937.31000002,108140816.27764998,114960532.39565724]
[]
["Repairs and Maintenance \nby Expenditure Item",14]
["Employee related costs",null,null,null,null,null,null,null,null,{"$f":"SUM(E161:I161)","v":0},{"$f":"IF(D161=0,C161+J161,D161+J161)","v":0}]
["Other materials",null,{"$f":"17098649.14+5000000","v":22098649.140000001},null,null,null,null,null,-6131347,{"$f":"SUM(E162:I162)","v":-6131347},{"$f":"IF(D162=0,C162+J162,D162+J162)","v":15967302.140000001}]
["Contracted Services",null,null,null,null,null,null,null,null,{"$f":"SUM(E163:I163)","v":0},{"$f":"IF(D163=0,C163+J163,D163+J163)","v":0}]
["Other Expenditure",null,null,null,null,null,null,null,null,{"$f":"SUM(E164:I164)","v":0},{"$f":"IF(D164=0,C164+J164,D164+J164)","v":0}]
["Total Repairs and Maintenance Expenditure",15,{"$f":"SUM(C161:C164)","v":22098649.140000001},{"$f":"SUM(D161:D164)","v":0},0,0,0,0,-6131347,-6131347,15967302.140000001,0,0]
[{"$f":"head27a","v":"References"}]
["1. Must reconcile with relevant line on the 'Financial Performance' budget"]
["2. Must reconcile to supporting documentation on staff salaries"]
["3. Insert other categories where revenue or expenditure is of a material nature"]
["4. Expenditure to meet any unfunded obligations"]
["5. Special consideration may have to be given to including 'goodwill arising' or 'joint venture' budgets where circumstances require this (include separately under relevant notes)"]
["6. Only complete if a previous adjusted budget has been approved in the same financial year. Reflect most recent adjusted budget."]
["7. Additional cash-backed accumulated funds/unspent funds (section 18(1)(b) and section 28(2)(e) MFMA) identified after Original Budget approved and after annual financial statements audited (note: only where underspending could not reasonably be have for"]
["8. Increases of funds approved under section 31 MFMA"]
["9. Adjustments approved in accordance with section 29 MFMA"]
["10. Adjustments to funding allocations from National or Provincial Government"]
["11. Adjusts. = 'Other' Adjustments proposed to be approved; including revenue under-collection (MFMA section 28(2)(a)); additional revenue appropriation on existing programmes (section 28(2))(b); projected savings (section 28(2)(d)); error correction (sec"]
["12. G = B + C + D + E + F"]
["13. Adjusted Budget H = (A or A1/2 etc) + G"]
["14. Repairs and Maintenance is not a GRAP item. However to facilitate transparency, municipalities must provide a breakdown of the amounts included in the relevant GRAP items that will be spent on Repairs and Maintenance."]
["15. Must reconcile with Repairs and Maintenance by Asset Class (Total Repairs and Maintenance) on Table SA34c."]

{"sheet":"SB2","index":20,"n_rows":80,"n_cols":13,"rows_kept":80,"cut":false,"hidden":false,"merged":[[76,0,76,12],[72,0,72,12],[1,1,3,1],[1,0,3,0],[1,2,1,10]]}
[{"$f":"muni&\" - \"&ADJB2&\" - \"&Date","v":"LIM332 Greater Letaba - Supporting Table SB2 Supporting detail to 'Financial Position Budget' - 27 February 2019"}]
[{"$f":"desc","v":"Description"},{"$f":"head27","v":"Ref"},{"$f":"Head2","v":"Budget Year 2018/19"},null,null,null,null,null,null,null,null,{"$f":"Head10","v":"Budget Year +1 2019/20"},{"$f":"Head11","v":"Budget Year +2 2020/21"}]
[null,null,{"$f":"Head6","v":"Original Budget"},{"$f":"Head54","v":"Prior Adjusted"},{"$f":"Head51","v":"Accum. Funds"},{"$f":"Head52","v":"Multi-year capital"},{"$f":"Head53","v":"Unfore. Unavoid."},{"$f":"Head55","v":"Nat. or Prov. Govt"},{"$f":"Head50","v":"Other Adjusts."},{"$f":"Head56","v":"Total Adjusts."},{"$f":"Head7","v":"Adjusted Budget"},{"$f":"Head7","v":"Adjusted Budget"},{"$f":"Head7","v":"Adjusted Budget"}]
[null,null,null,4,5,6,7,8,9,10,11]
["R thousands",null,"A","A1","B","C","D","E","F","G","H"]
["ASSETS"]
["Call investment deposits"]
["Call deposits",null,{"$f":"50342658.94-23390000+1568622.59","v":28521281.529999997},null,null,null,null,null,{"$f":"-10000000-8000000-7000000","v":-25000000},{"$f":"SUM(E8:I8)","v":-25000000},{"$f":"IF(D8=0,C8+J8,D8+J8)","v":3521281.5299999975},{"$f":"5131281.53+15000000-15000000","v":5131281.5300000012},{"$f":"5413502.01415+14000000-14000000","v":5413502.0141500011}]
["Other current investments",null,0,null,null,null,null,null,0,{"$f":"SUM(E9:I9)","v":0},{"$f":"IF(D9=0,C9+J9,D9+J9)","v":0}]
[{"$f":"\"Total \"&A7","v":"Total Call investment deposits"},1,{"$f":"SUM(C8:C9)","v":28521281.529999997},0,0,0,0,0,-25000000,-25000000,3521281.5299999975,5131281.5300000012,5413502.0141500011]
["Consumer debtors"]
[{"$f":"A11","v":"Consumer debtors"},null,6900000,null,null,null,null,null,0,{"$f":"SUM(E12:I12)","v":0},{"$f":"IF(D12=0,C12+J12,D12+J12)","v":6900000},7000000,7000000]
["Less: provision for debt impairment",null,{"$f":"C19","v":0},0,0,0,0,0,0,{"$f":"SUM(E13:I13)","v":0},{"$f":"IF(D13=0,C13+J13,D13+J13)","v":0},{"$f":"L19","v":0},{"$f":"M19","v":0}]
[{"$f":"\"Total \"&A11","v":"Total Consumer debtors"},1,{"$f":"C12-C13","v":6900000},{"$f":"D12-D13","v":0},0,0,0,0,0,0,6900000,7000000,7000000]
["Debt impairment provision"]
["Balance at the beginning of the year",null,null,null,null,null,null,null,null,{"$f":"SUM(E16:I16)","v":0},{"$f":"IF(D16=0,C16+J16,D16+J16)","v":0},{"$f":"IF(SUM(L17:L18)=0,0,K19)","v":0},{"$f":"IF(SUM(M17:M18)=0,0,L19)","v":0}]
["Contributions to the provision",null,null,null,null,null,null,null,null,{"$f":"SUM(E17:I17)","v":0},{"$f":"IF(D17=0,C17+J17,D17+J17)","v":0}]
["Bad debts written off",null,null,null,null,null,null,null,null,{"$f":"SUM(E18:I18)","v":0},{"$f":"IF(D18=0,C18+J18,D18+J18)","v":0}]
["Balance at end of year",null,{"$f":"SUM(C16:C18)","v":0},0,0,0,0,0,0,{"$f":"J13","v":0},{"$f":"K13","v":0},{"$f":"SUM(L16:L18)","v":0},{"$f":"SUM(M16:M18)","v":0}]
["Property, plant & equipment"]
["PPE at cost/valuation (excl. finance leases)",null,1056104661.929456,null,null,null,null,null,-5615913,{"$f":"SUM(E21:I21)","v":-5615913},{"$f":"IF(D21=0,C21+J21,D21+J21)","v":1050488748.929456},{"$f":"1056104661.92946+160774440","v":1216879101.92946},{"$f":"1056104661.92946+178774129","v":1234878790.92946}]
["Leases recognised as PPE",2,0,null,null,null,null,null,0,{"$f":"SUM(E22:I22)","v":0},{"$f":"IF(D22=0,C22+J22,D22+J22)","v":0},0,0]
["Less: Accumulated depreciation",null,202188723.32471713,null,null,null,null,null,-310000,{"$f":"SUM(E23:I23)","v":-310000},{"$f":"IF(D23=0,C23+J23,D23+J23)","v":201878723.32471713},{"$f":"K23*105.4/100","v":212780174.38425186},{"$f":"L23*105.5/100","v":224483083.9753857}]
[{"$f":"\"Total \"&A20","v":"Total Property, plant & equipment"},1,{"$f":"SUM(C21:C22)-C23","v":853915938.60473883},{"$f":"SUM(D21:D22)-D23","v":0},0,0,0,0,-5305913,-5305913,848610025.60473883,{"$f":"SUM(L21:L22)-L23","v":1004098927.5452082},{"$f":"SUM(M21:M22)-M23","v":1010395706.9540744}]
[]
["LIABILITIES"]
["Current liabilities - Borrowing"]
["Short term loans (other than bank overdraft)",null,0,0,0,0,0,0,0,{"$f":"SUM(E28:I28)","v":0},{"$f":"IF(D28=0,C28+J28,D28+J28)","v":0},0,0]
["Current portion of long-term liabilities",null,0,0,0,0,0,0,0,{"$f":"SUM(E29:I29)","v":0},{"$f":"IF(D29=0,C29+J29,D29+J29)","v":0},0,0]
[{"$f":"\"Total \"&A27","v":"Total Current liabilities - Borrowing"},null,{"$f":"SUM(C28:C29)","v":0},0,0,0,0,0,0,0,0,0,0]
["Trade and other payables"]
["Creditors",null,35693282,null,null,null,null,null,0,{"$f":"SUM(E32:I32)","v":0},{"$f":"IF(D32=0,C32+J32,D32+J32)","v":35693282},35000000,36100000]
["Unspent conditional grants and receipts",null,0,null,null,null,null,null,0,{"$f":"SUM(E33:I33)","v":0},{"$f":"IF(D33=0,C33+J33,D33+J33)","v":0},0,0]
["VAT",null,0,null,null,null,null,null,0,{"$f":"SUM(E34:I34)","v":0},{"$f":"IF(D34=0,C34+J34,D34+J34)","v":0},0,0]
[{"$f":"\"Total \"&A31","v":"Total Trade and other payables"},1,{"$f":"SUM(C32:C34)","v":35693282},0,0,0,0,0,0,0,35693282,35000000,36100000]
["Non current liabilities - Borrowing"]
["Borrowing",3,0,null,null,null,null,null,0,{"$f":"SUM(E37:I37)","v":0},{"$f":"IF(D37=0,C37+J37,D37+J37)","v":0},0,0]
["Finance leases (including PPP asset element)",null,0,null,null,null,null,null,null,{"$f":"SUM(E38:I38)","v":0},{"$f":"IF(D38=0,C38+J38,D38+J38)","v":0},0,0]
[{"$f":"\"Total \"&A36","v":"Total Non current liabilities - Borrowing"},null,{"$f":"SUM(C37:C38)","v":0},0,0,0,0,0,0,0,0,0,0]
["Provisions - non current"]
["Retirement benefits",null,12327649.647768002,null,null,null,null,null,0,{"$f":"SUM(E41:I41)","v":0},{"$f":"IF(D41=0,C41+J41,D41+J41)","v":12327649.647768002},{"$f":"K41*105.4/100","v":12993342.728747476},{"$f":"L41*105.5/100","v":13707976.578828588}]
["List other major items",null,0,null,null,null,null,null,null,{"$f":"SUM(E42:I42)","v":0},{"$f":"IF(D42=0,C42+J42,D42+J42)","v":0},0,0]
["Refuse landfill site rehabilitation",null,2416800,null,null,null,null,null,0,{"$f":"SUM(E43:I43)","v":0},{"$f":"IF(D43=0,C43+J43,D43+J43)","v":2416800},2416800,2416800]
["Other",null,0,null,null,null,null,null,0,{"$f":"SUM(E44:I44)","v":0},{"$f":"IF(D44=0,C44+J44,D44+J44)","v":0},0,0]
[{"$f":"\"Total \"&A40","v":"Total Provisions - non current"},null,{"$f":"SUM(C41:C44)","v":14744449.647768002},{"$f":"SUM(D41:D44)","v":0},0,0,0,0,0,0,14744449.647768002,15410142.728747476,16124776.578828588]
[]
["CHANGES IN NET ASSETS"]
["Accumulated surplus/(Deficit)"]
[{"$f":"A48&\" - opening balance\"","v":"Accumulated surplus/(Deficit) - opening balance"},null,900303209.23057282,null,null,null,null,null,-31000913,{"$f":"SUM(E49:I49)","v":-31000913},{"$f":"IF(D49=0,C49+J49,D49+J49)","v":869302296.23057282},1031115483.0182173,1039531561.338099]
["Appropriations to Reserves",null,0,null,null,null,null,null,0,{"$f":"SUM(E50:I50)","v":0},{"$f":"IF(D50=0,C50+J50,D50+J50)","v":0},0,0]
["Transfers from Reserves",null,0,null,null,null,null,null,0,{"$f":"SUM(E51:I51)","v":0},{"$f":"IF(D51=0,C51+J51,D51+J51)","v":0},0,0]
["Depreciation offsets",null,0,null,null,null,null,null,0,{"$f":"SUM(E52:I52)","v":0},{"$f":"IF(D52=0,C52+J52,D52+J52)","v":0},0,0]
["Other adjustments",null,0,null,null,null,null,null,0,{"$f":"SUM(E53:I53)","v":0},{"$f":"IF(D53=0,C53+J53,D53+J53)","v":0},0,0]
["Accumulated Surplus/(Deficit)",1,{"$f":"SUM(C49:C53)","v":900303209.23057282},{"$f":"SUM(D49:D53)","v":0},0,0,0,0,{"$f":"SUM(I49:I53)","v":-31000913},-31000913,869302296.23057282,1031115483.0182173,1039531561.338099]
["Reserves"]
["Housing Development Fund",null,0,null,null,null,null,null,0,{"$f":"SUM(E56:I56)","v":0},{"$f":"IF(D56=0,C56+J56,D56+J56)","v":0},0,0]
["Capital replacement",null,0,null,null,null,null,null,0,{"$f":"SUM(E57:I57)","v":0},{"$f":"IF(D57=0,C57+J57,D57+J57)","v":0},0,0]
["Self-insurance",null,0,null,null,null,null,null,0,{"$f":"SUM(E58:I58)","v":0},{"$f":"IF(D58=0,C58+J58,D58+J58)","v":0},0,0]
["Other reserves (list)",null,0,null,null,null,null,null,0,{"$f":"SUM(E59:I59)","v":0},{"$f":"IF(D59=0,C59+J59,D59+J59)","v":0},0,0]
["Revaluation",null,0,null,null,null,null,null,0,{"$f":"SUM(E60:I60)","v":0},{"$f":"IF(D60=0,C60+J60,D60+J60)","v":0},0,0]
["Total Reserves",2,{"$f":"SUM(C56:C60)","v":0},0,0,0,0,0,0,0,0,0,0]
["TOTAL COMMUNITY WEALTH/EQUITY",2,{"$f":"C54+C61","v":900303209.23057282},0,0,0,0,0,-31000913,-31000913,869302296.23057282,1031115483.0182173,1039531561.338099]
[]
["Total capital expenditure includes expenditure on nationally significant priorities:"]
["Provision of basic services",null,null,null,null,null,null,null,null,{"$f":"SUM(E65:I65)","v":0},{"$f":"IF(D65=0,C65+J65,D65+J65)","v":0}]
["2010 World Cup",null,null,null,null,null,null,null,null,{"$f":"SUM(E66:I66)","v":0},{"$f":"IF(D66=0,C66+J66,D66+J66)","v":0}]
[null,null,null,null,null,null,null,null,null,{"$f":"SUM(E67:I67)","v":0},{"$f":"IF(D67=0,C67+J67,D67+J67)","v":0}]
[{"$f":"head27a","v":"References"}]
["1. Must reconcile with 'Financial Position' budget"]
["2. Leases treated as assets to be depreciated as the same as purchased/constructed assets.  Includes PPP asset element accounted for as finance leases"]
["3. Borrowing (original budget) must reconcile to Budget Table A16"]
["4. Only complete if a previous adjusted budget has been approved in the same financial year. Reflect most recent adjusted budget."]
["5. Additional cash-backed accumulated funds/unspent funds (section 18(1)(b) and section 28(2)(e) MFMA) identified after Original Budget approved and after annual financial statements audited (note: only where underspending could not reasonably be have for"]
["6. Increases of funds approved under section 31 MFMA"]
["7. Adjustments approved in accordance with section 29 MFMA"]
["8. Adjustments to funding allocations from National or Provincial Government"]
["9. Adjusts. = 'Other' Adjustments proposed to be approved; including revenue under-collection (MFMA section 28(2)(a)); additional revenue appropriation on existing programmes (section 28(2))(b); projected savings (section 28(2)(d)); error correction (sect"]
["10. G = B + C + D + E + F"]
["11. Adjusted Budget H = (A or A1/2 etc) + G"]
["check",null,{"$f":"C62-'B6-FinPos'!C50","v":0},null,null,null,null,null,null,null,null,null,{"$f":"K62-'B6-FinPos'!K50","v":0}]

{"sheet":"SB3","index":21,"n_rows":75,"n_cols":13,"rows_kept":75,"cut":false,"hidden":false,"merged":[[74,0,74,12],[69,0,69,12],[1,0,3,0],[1,1,3,1],[1,2,1,10],[73,0,73,12]]}
[{"$f":"muni&\" - \"&ADJB3&\" - \"&Date","v":"LIM332 Greater Letaba - Supporting Table SB3 Adjustments to the SDBIP - performance objectives - 27 February 2019"}]
[{"$f":"desc","v":"Description"},"Unit of measurement",{"$f":"Head2","v":"Budget Year 2018/19"},null,null,null,null,null,null,null,null,{"$f":"Head10","v":"Budget Year +1 2019/20"},{"$f":"Head11","v":"Budget Year +2 2020/21"}]
[null,null,{"$f":"Head6","v":"Original Budget"},{"$f":"Head54","v":"Prior Adjusted"},{"$f":"Head51","v":"Accum. Funds"},{"$f":"Head52","v":"Multi-year capital"},{"$f":"Head53","v":"Unfore. Unavoid."},{"$f":"Head55","v":"Nat. or Prov. Govt"},{"$f":"Head50","v":"Other Adjusts."},{"$f":"Head56","v":"Total Adjusts."},{"$f":"Head7","v":"Adjusted Budget"},{"$f":"Head7","v":"Adjusted Budget"},{"$f":"Head7","v":"Adjusted Budget"}]
[null,null,"A","A1","B","C","D","E","F","G","H"]
["Vote 1 - vote name"]
["Function 1 - (Roads)"]
["Eradication of Backlogs"]
["Reduce roads backlogs","Kilometre",0.01,null,null,null,null,null,0,{"$f":"SUM(E8:I8)","v":0},{"$f":"IF(D8=0,C8+J8,D8+J8)","v":0.01},{"$f":"IF(E8=0,D8+K8,E8+K8)","v":0.01},{"$f":"IF(F8=0,E8+L8,F8+L8)","v":0.01}]
[]
["Sub-function 2 - (Road Maintenance)"]
["Surface roads resurfed/rehabilitated","Kilometre",0.01,null,null,null,null,null,0,{"$f":"SUM(E11:I11)","v":0},{"$f":"IF(D11=0,C11+J11,D11+J11)","v":0.01},{"$f":"IF(E11=0,D11+K11,E11+K11)","v":0.01},{"$f":"IF(F11=0,E11+L11,F11+L11)","v":0.01}]
["Sub-function 3 - Roads for growth"]
["New roads to be constructed","Kilometre"]
[]
["Function 2 - Storm water",null,2.7E-2,null,null,null,null,null,null,{"$f":"SUM(E15:I15)","v":0},{"$f":"IF(D15=0,C15+J15,D15+J15)","v":2.7E-2},{"$f":"IF(E15=0,D15+K15,E15+K15)","v":2.7E-2},{"$f":"IF(F15=0,E15+L15,F15+L15)","v":2.7E-2}]
["Sub-function 1 - Reduction of backlogs"]
["Stormwater drainage to reduce backlogs","Kilometre"]
[]
["Sub-function 2 - stormwater for growth",null,null,null,null,null,null,null,null,{"$f":"SUM(E19:I19)","v":0},{"$f":"IF(D19=0,C19+J19,D19+J19)","v":0},{"$f":"IF(E19=0,D19+K19,E19+K19)","v":0},{"$f":"IF(F19=0,E19+L19,F19+L19)","v":0}]
["Stormwater drainage to stimilate growth","Kilometre"]
[null,null,null,null,null,null,null,null,null,{"$f":"SUM(E21:I21)","v":0},{"$f":"IF(D21=0,C21+J21,D21+J21)","v":0},{"$f":"IF(E21=0,D21+K21,E21+K21)","v":0},{"$f":"IF(F21=0,E21+L21,F21+L21)","v":0}]
[]
["Sub-function 3 - (name)",null,null,null,null,null,null,null,null,{"$f":"SUM(E23:I23)","v":0},{"$f":"IF(D23=0,C23+J23,D23+J23)","v":0},{"$f":"IF(E23=0,D23+K23,E23+K23)","v":0},{"$f":"IF(F23=0,E23+L23,F23+L23)","v":0}]
["Insert measure/s description"]
[null,null,null,null,null,null,null,null,null,{"$f":"SUM(E25:I25)","v":0},{"$f":"IF(D25=0,C25+J25,D25+J25)","v":0},{"$f":"IF(E25=0,D25+K25,E25+K25)","v":0},{"$f":"IF(F25=0,E25+L25,F25+L25)","v":0}]
["Vote 2 - vote name"]
["Function 1 - (name)"]
["Sub-function 1 - (name)"]
["Insert measure/s description",null,null,null,null,null,null,null,null,{"$f":"SUM(E29:I29)","v":0},{"$f":"IF(D29=0,C29+J29,D29+J29)","v":0},{"$f":"IF(E29=0,D29+K29,E29+K29)","v":0},{"$f":"IF(F29=0,E29+L29,F29+L29)","v":0}]
[]
["Sub-function 2 - (name)",null,null,null,null,null,null,null,null,{"$f":"SUM(E31:I31)","v":0},{"$f":"IF(D31=0,C31+J31,D31+J31)","v":0},{"$f":"IF(E31=0,D31+K31,E31+K31)","v":0},{"$f":"IF(F31=0,E31+L31,F31+L31)","v":0}]
["Insert measure/s description"]
[null,null,null,null,null,null,null,null,null,{"$f":"SUM(E33:I33)","v":0},{"$f":"IF(D33=0,C33+J33,D33+J33)","v":0},{"$f":"IF(E33=0,D33+K33,E33+K33)","v":0},{"$f":"IF(F33=0,E33+L33,F33+L33)","v":0}]
["Sub-function 3 - (name)"]
["Insert measure/s description",null,null,null,null,null,null,null,null,{"$f":"SUM(E35:I35)","v":0},{"$f":"IF(D35=0,C35+J35,D35+J35)","v":0},{"$f":"IF(E35=0,D35+K35,E35+K35)","v":0},{"$f":"IF(F35=0,E35+L35,F35+L35)","v":0}]
[]
["Function 2 - (name)"]
["Sub-function 1 - (name)",null,null,null,null,null,null,null,null,{"$f":"SUM(E38:I38)","v":0},{"$f":"IF(D38=0,C38+J38,D38+J38)","v":0},{"$f":"IF(E38=0,D38+K38,E38+K38)","v":0},{"$f":"IF(F38=0,E38+L38,F38+L38)","v":0}]
["Insert measure/s description"]
[null,null,null,null,null,null,null,null,null,{"$f":"SUM(E40:I40)","v":0},{"$f":"IF(D40=0,C40+J40,D40+J40)","v":0},{"$f":"IF(E40=0,D40+K40,E40+K40)","v":0},{"$f":"IF(F40=0,E40+L40,F40+L40)","v":0}]
["Sub-function 2 - (name)"]
["Insert measure/s description",null,null,null,null,null,null,null,null,{"$f":"SUM(E42:I42)","v":0},{"$f":"IF(D42=0,C42+J42,D42+J42)","v":0},{"$f":"IF(E42=0,D42+K42,E42+K42)","v":0},{"$f":"IF(F42=0,E42+L42,F42+L42)","v":0}]
[]
["Sub-function 3 - (name)"]
["Insert measure/s description"]
[null,null,null,null,null,null,null,null,null,{"$f":"SUM(E46:I46)","v":0},{"$f":"IF(D46=0,C46+J46,D46+J46)","v":0},{"$f":"IF(E46=0,D46+K46,E46+K46)","v":0},{"$f":"IF(F46=0,E46+L46,F46+L46)","v":0}]
["Vote 3 - vote name"]
["Function 1 - (name)",null,null,null,null,null,null,null,null,{"$f":"SUM(E48:I48)","v":0},{"$f":"IF(D48=0,C48+J48,D48+J48)","v":0},{"$f":"IF(E48=0,D48+K48,E48+K48)","v":0},{"$f":"IF(F48=0,E48+L48,F48+L48)","v":0}]
["Sub-function 1 - (name)"]
["Insert measure/s description"]
[null,null,null,null,null,null,null,null,null,{"$f":"SUM(E51:I51)","v":0},{"$f":"IF(D51=0,C51+J51,D51+J51)","v":0},{"$f":"IF(E51=0,D51+K51,E51+K51)","v":0},{"$f":"IF(F51=0,E51+L51,F51+L51)","v":0}]
["Sub-function 2 - (name)"]
["Insert measure/s description",null,null,null,null,null,null,null,null,{"$f":"SUM(E53:I53)","v":0},{"$f":"IF(D53=0,C53+J53,D53+J53)","v":0},{"$f":"IF(E53=0,D53+K53,E53+K53)","v":0},{"$f":"IF(F53=0,E53+L53,F53+L53)","v":0}]
[]
["Sub-function 3 - (name)",null,null,null,null,null,null,null,null,{"$f":"SUM(E55:I55)","v":0},{"$f":"IF(D55=0,C55+J55,D55+J55)","v":0},{"$f":"IF(E55=0,D55+K55,E55+K55)","v":0},{"$f":"IF(F55=0,E55+L55,F55+L55)","v":0}]
["Insert measure/s description"]
[]
["Function 2 - (name)",null,null,null,null,null,null,null,null,{"$f":"SUM(E58:I58)","v":0},{"$f":"IF(D58=0,C58+J58,D58+J58)","v":0},{"$f":"IF(E58=0,D58+K58,E58+K58)","v":0},{"$f":"IF(F58=0,E58+L58,F58+L58)","v":0}]
["Sub-function 1 - (name)"]
["Insert measure/s description",null,null,null,null,null,null,null,null,{"$f":"SUM(E60:I60)","v":0},{"$f":"IF(D60=0,C60+J60,D60+J60)","v":0},{"$f":"IF(E60=0,D60+K60,E60+K60)","v":0},{"$f":"IF(F60=0,E60+L60,F60+L60)","v":0}]
[]
["Sub-function 2 - (name)",null,null,null,null,null,null,null,null,{"$f":"SUM(E62:I62)","v":0},{"$f":"IF(D62=0,C62+J62,D62+J62)","v":0},{"$f":"IF(E62=0,D62+K62,E62+K62)","v":0},{"$f":"IF(F62=0,E62+L62,F62+L62)","v":0}]
["Insert measure/s description"]
[null,null,null,null,null,null,null,null,null,{"$f":"SUM(E64:I64)","v":0},{"$f":"IF(D64=0,C64+J64,D64+J64)","v":0},{"$f":"IF(E64=0,D64+K64,E64+K64)","v":0},{"$f":"IF(F64=0,E64+L64,F64+L64)","v":0}]
["Sub-function 3 - (name)"]
["Insert measure/s description",null,null,null,null,null,null,null,null,{"$f":"SUM(E66:I66)","v":0},{"$f":"IF(D66=0,C66+J66,D66+J66)","v":0},{"$f":"IF(E66=0,D66+K66,E66+K66)","v":0},{"$f":"IF(F66=0,E66+L66,F66+L66)","v":0}]
[]
["And so on for the rest of the Votes",null,null,null,null,null,null,null,null,{"$f":"SUM(E68:I68)","v":0},{"$f":"IF(D68=0,C68+J68,D68+J68)","v":0},{"$f":"IF(E68=0,D68+K68,E68+K68)","v":0},{"$f":"IF(F68=0,E68+L68,F68+L68)","v":0}]
[{"$f":"head27a","v":"References"}]
["1. Include a measurable performance objective for each revenue source (within a relevant function) and each vote (MFMA s17(3)(b))"]
["2. Include the estimated effect on the target of each component of an adjustment budget (B to G)"]
["3. Include all Basic Services performance targets from Table A10 to ensure Table SA7 represents all strategic responsibilities"]
["4. Total target adjustments G = B + C + D + E + F"]
["5. Total Adjusted Budget targets H = (A or A1/2 etc) + G"]
["6. NOTE - include adjustsment by 'exception' (only where amended)"]

{"sheet":"SB4","index":22,"n_rows":49,"n_cols":11,"rows_kept":49,"cut":false,"hidden":false,"merged":[[1,0,2,0],[1,1,2,1],[1,5,1,7],[28,0,29,0],[25,0,26,0]]}
[{"$f":"muni&\" - \"&ADJB4&\" - \"&Date","v":"LIM332 Greater Letaba - Supporting Table SB4 Adjustments to budgeted performance indicators and benchmarks - 27 February 2019"}]
[{"$f":"desc&\" of financial indicator\"","v":"Description of financial indicator"},"Basis of calculation",{"$f":"Head1B","v":"2015/16"},{"$f":"Head1A","v":"2016/17"},{"$f":"Head1","v":"2017/18"},{"$f":"Head2","v":"Budget Year 2018/19"},null,null,{"$f":"Head10","v":"Budget Year +1 2019/20"},{"$f":"Head11","v":"Budget Year +2 2020/21"}]
[null,null,{"$f":"Head5","v":"Audited Outcome"},{"$f":"Head5","v":"Audited Outcome"},{"$f":"Head5","v":"Audited Outcome"},{"$f":"Head6","v":"Original Budget"},{"$f":"Head54","v":"Prior Adjusted"},{"$f":"Head7","v":"Adjusted Budget"},{"$f":"Head7","v":"Adjusted Budget"},{"$f":"Head7","v":"Adjusted Budget"}]
["Borrowing Management"]
[]
["Credit Rating","Short term/long term rating"]
["Capital Charges to Operating Expenditure","Interest & Principal Paid /Operating Expenditure",null,null,null,{"$f":"IF(ISERROR(('B4-FinPerf RE'!C30-'B7-CFlow'!C37)/'B4-FinPerf RE'!C37),0,(('B4-FinPerf RE'!C30-'B7-CFlow'!C37)/'B4-FinPerf RE'!C37))","v":0},{"$f":"IF(ISERROR(('B4-FinPerf RE'!D30-'B7-CFlow'!D37)/'B4-FinPerf RE'!D37),0,(('B4-FinPerf RE'!D30-'B7-CFlow'!D37)/'B4-FinPerf RE'!D37))","v":0},{"$f":"IF(ISERROR(('B4-FinPerf RE'!K30-'B7-CFlow'!K37)/'B4-FinPerf RE'!K37),0,(('B4-FinPerf RE'!K30-'B7-CFlow'!K37)/'B4-FinPerf RE'!K37))","v":0},{"$f":"IF(ISERROR(('B4-FinPerf RE'!L30-'B7-CFlow'!L37)/'B4-FinPerf RE'!L37),0,(('B4-FinPerf RE'!L30-'B7-CFlow'!L37)/'B4-FinPerf RE'!L37))","v":0},{"$f":"IF(ISERROR(('B4-FinPerf RE'!M30-'B7-CFlow'!M37)/'B4-FinPerf RE'!M37),0,(('B4-FinPerf RE'!M30-'B7-CFlow'!M37)/'B4-FinPerf RE'!M37))","v":0}]
["Capital Charges to Own Revenue","Finance charges & Repayment of borrowing /Own Revenue",null,null,null,{"$f":"IF(ISERROR(('B4-FinPerf RE'!C31-'B7-CFlow'!C38)/'B4-FinPerf RE'!C38),0,(('B4-FinPerf RE'!C31-'B7-CFlow'!C38)/'B4-FinPerf RE'!C38))","v":0},{"$f":"IF(ISERROR(('B4-FinPerf RE'!D31-'B7-CFlow'!D38)/'B4-FinPerf RE'!D38),0,(('B4-FinPerf RE'!D31-'B7-CFlow'!D38)/'B4-FinPerf RE'!D38))","v":0},{"$f":"IF(ISERROR(('B4-FinPerf RE'!K31-'B7-CFlow'!K38)/'B4-FinPerf RE'!K38),0,(('B4-FinPerf RE'!K31-'B7-CFlow'!K38)/'B4-FinPerf RE'!K38))","v":0},{"$f":"IF(ISERROR(('B4-FinPerf RE'!L31-'B7-CFlow'!L38)/'B4-FinPerf RE'!L38),0,(('B4-FinPerf RE'!L31-'B7-CFlow'!L38)/'B4-FinPerf RE'!L38))","v":0},{"$f":"IF(ISERROR(('B4-FinPerf RE'!M31-'B7-CFlow'!M38)/'B4-FinPerf RE'!M38),0,(('B4-FinPerf RE'!M31-'B7-CFlow'!M38)/'B4-FinPerf RE'!M38))","v":0}]
["Borrowed funding of 'own' capital expenditure","Borrowing/Capital expenditure excl. transfers and grants",null,null,null,{"$f":"IF(ISERROR('B5-Capex'!C74/('B5-Capex'!C65-'B5-Capex'!C72)),0,('B5-Capex'!C74/('B5-Capex'!C65-'B5-Capex'!C72)))","v":0},{"$f":"IF(ISERROR('B5-Capex'!D74/('B5-Capex'!D65-'B5-Capex'!D72)),0,('B5-Capex'!D74/('B5-Capex'!D65-'B5-Capex'!D72)))","v":0},{"$f":"IF(ISERROR('B5-Capex'!K74/('B5-Capex'!K65-'B5-Capex'!L72)),0,('B5-Capex'!K74/('B5-Capex'!K65-'B5-Capex'!L72)))","v":0},{"$f":"IF(ISERROR('B5-Capex'!L74/('B5-Capex'!L65-'B5-Capex'!M72)),0,('B5-Capex'!L74/('B5-Capex'!L65-'B5-Capex'!M72)))","v":0},{"$f":"IF(ISERROR('B5-Capex'!M74/('B5-Capex'!M65-'B5-Capex'!N72)),0,('B5-Capex'!M74/('B5-Capex'!M65-'B5-Capex'!N72)))","v":0}]
["Safety of Capital"]
["Gearing","Long Term Borrowing/ Funds & Reserves",null,null,null,{"$f":"IF(ISERROR('B6-FinPos'!C39/'B6-FinPos'!C48),0,('B6-FinPos'!C39/'B6-FinPos'!C48))","v":0},{"$f":"IF(ISERROR('B6-FinPos'!D39/'B6-FinPos'!D48),0,('B6-FinPos'!D39/'B6-FinPos'!D48))","v":0},{"$f":"IF(ISERROR('B6-FinPos'!K39/'B6-FinPos'!K48),0,('B6-FinPos'!K39/'B6-FinPos'!K48))","v":0},{"$f":"IF(ISERROR('B6-FinPos'!L39/'B6-FinPos'!L48),0,('B6-FinPos'!L39/'B6-FinPos'!L48))","v":0},{"$f":"IF(ISERROR('B6-FinPos'!M39/'B6-FinPos'!M48),0,('B6-FinPos'!M39/'B6-FinPos'!M48))","v":0}]
["Liquidity"]
["Current Ratio","Current assets/current liabilities",3.8690507275272927,null,null,{"$f":"IF(ISERROR('B6-FinPos'!C14/'B6-FinPos'!C36),0,('B6-FinPos'!C14/'B6-FinPos'!C36))","v":2.6672415511177197},{"$f":"IF(ISERROR('B6-FinPos'!D14/'B6-FinPos'!D36),0,('B6-FinPos'!D14/'B6-FinPos'!D36))","v":0},{"$f":"IF(ISERROR('B6-FinPos'!K14/'B6-FinPos'!K36),0,('B6-FinPos'!K14/'B6-FinPos'!K36))","v":1.9547424631841419},{"$f":"IF(ISERROR('B6-FinPos'!L14/'B6-FinPos'!L36),0,('B6-FinPos'!L14/'B6-FinPos'!L36))","v":2.1704201684079973},{"$f":"IF(ISERROR('B6-FinPos'!M14/'B6-FinPos'!M36),0,('B6-FinPos'!M14/'B6-FinPos'!M36))","v":2.2120886348607436}]
["Current Ratio adjusted for aged debtors","Current assets/current liabilities less debtors > 90 days/current liabilities",3.8690507275272927,null,null,{"$f":"IF(ISERROR(('B6-FinPos'!C14-'SB4'!F44)/'B6-FinPos'!C36),0,(('B6-FinPos'!C14-'SB4'!F44)/'B6-FinPos'!C36))","v":2.6672415511177197},{"$f":"IF(ISERROR(('B6-FinPos'!D14-'SB4'!G44)/'B6-FinPos'!D36),0,(('B6-FinPos'!D14-'SB4'!G44)/'B6-FinPos'!D36))","v":0},{"$f":"IF(ISERROR(('B6-FinPos'!E14-'SB4'!H44)/'B6-FinPos'!E36),0,(('B6-FinPos'!E14-'SB4'!H44)/'B6-FinPos'!E36))","v":0},{"$f":"IF(ISERROR(('B6-FinPos'!F14-'SB4'!I44)/'B6-FinPos'!F36),0,(('B6-FinPos'!F14-'SB4'!I44)/'B6-FinPos'!F36))","v":0},{"$f":"IF(ISERROR(('B6-FinPos'!G14-'SB4'!J44)/'B6-FinPos'!G36),0,(('B6-FinPos'!G14-'SB4'!J44)/'B6-FinPos'!G36))","v":0}]
["Liquidity Ratio","Monetary Assets/Current Liabilities",null,null,null,{"$f":"IF(ISERROR(('B6-FinPos'!C8+'B6-FinPos'!C9)/'B6-FinPos'!C36),0,(('B6-FinPos'!C8+'B6-FinPos'!C9)/'B6-FinPos'!C36))","v":0.82414422970780654},{"$f":"IF(ISERROR(('B6-FinPos'!D8+'B6-FinPos'!D9)/'B6-FinPos'!D36),0,(('B6-FinPos'!D8+'B6-FinPos'!D9)/'B6-FinPos'!D36))","v":0},{"$f":"IF(ISERROR(('B6-FinPos'!K8+'B6-FinPos'!K9)/'B6-FinPos'!K36),0,(('B6-FinPos'!K8+'B6-FinPos'!K9)/'B6-FinPos'!K36))","v":0.11164514177422877},{"$f":"IF(ISERROR(('B6-FinPos'!L8+'B6-FinPos'!L9)/'B6-FinPos'!L36),0,(('B6-FinPos'!L8+'B6-FinPos'!L9)/'B6-FinPos'!L36))","v":0.19853918651429714},{"$f":"IF(ISERROR(('B6-FinPos'!M8+'B6-FinPos'!M9)/'B6-FinPos'!M36),0,(('B6-FinPos'!M8+'B6-FinPos'!M9)/'B6-FinPos'!M36))","v":0.20619625447685699}]
["Revenue Management"]
["Annual Debtors Collection Rate (Payment Level %)","Last 12 Mths Receipts/ Last 12 Mths Billing",1.0050202367867929,null,null,0.80740487345751077,0.65240845103973688,0.65240845105194856,0.65240845105194856,0.65240845105194856]
["Current Debtors Collection Rate (Cash receipts % of Ratepayer & Other revenue)",null,0.4294826826513764,null,null,0.65240845103973688,0.65240845105194856,0.65240845106895196,0.65240845106895196,0.65240845106895196]
["Outstanding Debtors to Revenue","Total Outstanding Debtors to Annual Revenue",0.307165127785688,null,null,{"$f":"IF(ISERROR((SUM('B6-FinPos'!C10:C12)+'B6-FinPos'!C17)/'B4-FinPerf RE'!C23),0,((SUM('B6-FinPos'!C10:C12)+'B6-FinPos'!C17)/'B4-FinPerf RE'!C23))","v":0.18589671633531413},{"$f":"IF(ISERROR((SUM('B6-FinPos'!D10:D12)+'B6-FinPos'!D17)/'B4-FinPerf RE'!D23),0,((SUM('B6-FinPos'!D10:D12)+'B6-FinPos'!D17)/'B4-FinPerf RE'!D23))","v":0},{"$f":"IF(ISERROR((SUM('B6-FinPos'!K10:K12)+'B6-FinPos'!K17)/'B4-FinPerf RE'!K23),0,((SUM('B6-FinPos'!K10:K12)+'B6-FinPos'!K17)/'B4-FinPerf RE'!K23))","v":0.16357787318166833},{"$f":"IF(ISERROR((SUM('B6-FinPos'!L10:L12)+'B6-FinPos'!L17)/'B4-FinPerf RE'!L23),0,((SUM('B6-FinPos'!L10:L12)+'B6-FinPos'!L17)/'B4-FinPerf RE'!L23))","v":0.17112561442729449},{"$f":"IF(ISERROR((SUM('B6-FinPos'!M10:M12)+'B6-FinPos'!M17)/'B4-FinPerf RE'!M23),0,((SUM('B6-FinPos'!M10:M12)+'B6-FinPos'!M17)/'B4-FinPerf RE'!M23))","v":0.16643782963800285}]
["Longstanding Debtors Recovered","Debtors > 12 Mths Recovered/Total Debtors > 12 Months Old",null,null,null,{"$f":"IF(ISERROR(F45/'B6-FinPos'!C17),0,(F45/'B6-FinPos'!C17))","v":0},{"$f":"IF(ISERROR(G45/'B6-FinPos'!D17),0,(G45/'B6-FinPos'!D17))","v":0},{"$f":"IF(ISERROR(H45/'B6-FinPos'!K17),0,(H45/'B6-FinPos'!K17))","v":0},{"$f":"IF(ISERROR(I45/'B6-FinPos'!L17),0,(I45/'B6-FinPos'!L17))","v":0},{"$f":"IF(ISERROR(J45/'B6-FinPos'!M17),0,(J45/'B6-FinPos'!M17))","v":0}]
["Creditors Management"]
["Creditors System Efficiency","% of Creditors Paid Within Terms (within MFMA s 65(e))",1,1,1,1,1,1,1,1]
["Creditors to Cash and Investments",null,null,null,null,{"$f":"IF(ISERROR('SB2'!C35/'B7-CFlow'!C42), 0, ('SB2'!C35/'B7-CFlow'!C42))","v":1.7284763057916073},{"$f":"IF(ISERROR('SB2'!D35/'B7-CFlow'!D42), 0, ('SB2'!D35/'B7-CFlow'!D42))","v":0},{"$f":"IF(ISERROR('SB2'!K35/'B7-CFlow'!K42), 0, ('SB2'!K35/'B7-CFlow'!K42))","v":8.8653797314055076},{"$f":"IF(ISERROR('SB2'!L35/'B7-CFlow'!L42), 0, ('SB2'!L35/'B7-CFlow'!L42))","v":6.2103189453018821},{"$f":"IF(ISERROR('SB2'!M35/'B7-CFlow'!M42), 0, ('SB2'!M35/'B7-CFlow'!M42))","v":6.0993828370733594}]
[]
["Other Indicators"]
["Electricity Distribution Losses (2)","Total Volume Losses (kW)",2247610,2247610,2247610,2247610,2247610,2247610,2247610,2247610]
[null,"Total Cost of Losses (Rand '000)",3208869,2247610,6986097]
[null,"% Volume (units purchased and generated less units sold)/units purchased and generated",null,0.21460000000000001,0.21460000000000001,0.21460000000000001,0.21460000000000001,0.21460000000000001,0.21460000000000001,0.21460000000000001]
["Water Distribution Losses (2)","Total Volume Losses (kℓ)",null,1190325,1190325,1190325,1190325,1190325,1190325,1190325]
[null,"Total Cost of Losses (Rand '000)",null,6522981,6522981,6522981,6522981,6522981,6522981,6522981]
[null,"% Volume (units purchased and generated less units sold)/units purchased and generated",null,0.52929999999999999,0.52929999999999999,0.52929999999999999,0.52929999999999999,0.52929999999999999,0.52929999999999999,0.52929999999999999]
["Employee costs","Employee costs/(Total Revenue - capital revenue)",null,null,null,{"$f":"IF(ISERROR('B4-FinPerf RE'!C26/'B4-FinPerf RE'!C23),0,('B4-FinPerf RE'!C26/'B4-FinPerf RE'!C23))","v":0.23013155009056616},{"$f":"IF(ISERROR('B4-FinPerf RE'!D26/'B4-FinPerf RE'!D23),0,('B4-FinPerf RE'!D26/'B4-FinPerf RE'!D23))","v":0},{"$f":"IF(ISERROR('B4-FinPerf RE'!K26/'B4-FinPerf RE'!K23),0,('B4-FinPerf RE'!K26/'B4-FinPerf RE'!K23))","v":0.24636864854731544},{"$f":"IF(ISERROR('B4-FinPerf RE'!L26/'B4-FinPerf RE'!L23),0,('B4-FinPerf RE'!L26/'B4-FinPerf RE'!L23))","v":0.26171794321514819},{"$f":"IF(ISERROR('B4-FinPerf RE'!M26/'B4-FinPerf RE'!M23),0,('B4-FinPerf RE'!M26/'B4-FinPerf RE'!M23))","v":0.25805529548914691}]
["Remuneration","Total remuneration/(Total Revenue - capital revenue)"]
["Repairs & Maintenance","R&M/(Total Revenue excluding capital revenue)",null,null,null,{"$f":"IF(ISERROR('B9-Asset'!C171/'B4-FinPerf RE'!C23),0,('B9-Asset'!C171/'B4-FinPerf RE'!C23))","v":6.4946995677093514E-2},{"$f":"IF(ISERROR('B9-Asset'!D171/'B4-FinPerf RE'!D23),0,('B9-Asset'!D171/'B4-FinPerf RE'!D23))","v":0},{"$f":"IF(ISERROR('B9-Asset'!K171/'B4-FinPerf RE'!K23),0,('B9-Asset'!K171/'B4-FinPerf RE'!K23))","v":5.8878634619387679E-2},{"$f":"IF(ISERROR('B9-Asset'!L171/'B4-FinPerf RE'!L23),0,('B9-Asset'!L171/'B4-FinPerf RE'!L23))","v":2.998245478705484E-2},{"$f":"IF(ISERROR('B9-Asset'!M171/'B4-FinPerf RE'!M23),0,('B9-Asset'!M171/'B4-FinPerf RE'!M23))","v":2.9489970588347587E-2}]
["Finance charges & Depreciation","FC&D/(Total Revenue - capital revenue)",null,null,null,{"$f":"IF(ISERROR(('B4-FinPerf RE'!C29+'B4-FinPerf RE'!C30)/'B4-FinPerf RE'!C23),0,(('B4-FinPerf RE'!C29+'B4-FinPerf RE'!C30)/'B4-FinPerf RE'!C23))","v":1.4822280069831032E-2},{"$f":"IF(ISERROR(('B4-FinPerf RE'!D29+'B4-FinPerf RE'!D30)/'B4-FinPerf RE'!D23),0,(('B4-FinPerf RE'!D29+'B4-FinPerf RE'!D30)/'B4-FinPerf RE'!D23))","v":0},{"$f":"IF(ISERROR(('B4-FinPerf RE'!K29+'B4-FinPerf RE'!K30)/'B4-FinPerf RE'!K23),0,(('B4-FinPerf RE'!K29+'B4-FinPerf RE'!K30)/'B4-FinPerf RE'!K23))","v":1.53671819493211E-2},{"$f":"IF(ISERROR(('B4-FinPerf RE'!L29+'B4-FinPerf RE'!L30)/'B4-FinPerf RE'!L23),0,(('B4-FinPerf RE'!L29+'B4-FinPerf RE'!L30)/'B4-FinPerf RE'!L23))","v":1.7694230874402018E-2},{"$f":"IF(ISERROR(('B4-FinPerf RE'!M29+'B4-FinPerf RE'!M30)/'B4-FinPerf RE'!M23),0,(('B4-FinPerf RE'!M29+'B4-FinPerf RE'!M30)/'B4-FinPerf RE'!M23))","v":1.7468653938833907E-2}]
["IDP regulation financial viability indicators"]
["i. Debt coverage","(Total Operating Revenue - Operating Grants)/Debt service payments due within financial year)",null,null,null,{"$f":"IF(ISERROR(('B4-FinPerf RE'!C23-'B4-FinPerf RE'!C20)/('B4-FinPerf RE'!L30-'B7-CFlow'!L37)),0,(('B4-FinPerf RE'!C23-'B4-FinPerf RE'!C20)/('B4-FinPerf RE'!L30-'B7-CFlow'!L37)))","v":0},{"$f":"IF(ISERROR(('B4-FinPerf RE'!D23-'B4-FinPerf RE'!D20)/('B4-FinPerf RE'!L30-'B7-CFlow'!L37)),0,(('B4-FinPerf RE'!D23-'B4-FinPerf RE'!D20)/('B4-FinPerf RE'!L30-'B7-CFlow'!L37)))","v":0},{"$f":"IF(ISERROR(('B4-FinPerf RE'!K23-'B4-FinPerf RE'!K20)/('B4-FinPerf RE'!L30-'B7-CFlow'!L37)),0,(('B4-FinPerf RE'!K23-'B4-FinPerf RE'!K20)/('B4-FinPerf RE'!L30-'B7-CFlow'!L37)))","v":0},{"$f":"IF(ISERROR(('B4-FinPerf RE'!L23-'B4-FinPerf RE'!L20)/('B4-FinPerf RE'!M30-'B7-CFlow'!M37)),0,(('B4-FinPerf RE'!L23-'B4-FinPerf RE'!L20)/('B4-FinPerf RE'!M30-'B7-CFlow'!M37)))","v":0},{"$f":"IF(ISERROR(('B4-FinPerf RE'!M23-'B4-FinPerf RE'!M20)/('B4-FinPerf RE'!M30-'B7-CFlow'!M37)),0,(('B4-FinPerf RE'!M23-'B4-FinPerf RE'!M20)/('B4-FinPerf RE'!M30-'B7-CFlow'!M37)))","v":0}]
["ii. O/S Service Debtors to Revenue","Total outstanding service debtors/annual revenue received for services",null,null,null,{"$f":"IF(ISERROR('B6-FinPos'!C10/'B4-FinPerf RE'!C23),0,('B6-FinPos'!C10/'B4-FinPerf RE'!C23))","v":2.027880832592581E-2},{"$f":"IF(ISERROR('B6-FinPos'!D10/'B4-FinPerf RE'!D23),0,('B6-FinPos'!D10/'B4-FinPerf RE'!D23))","v":0},{"$f":"IF(ISERROR('B6-FinPos'!K10/'B4-FinPerf RE'!K23),0,('B6-FinPos'!K10/'B4-FinPerf RE'!K23))","v":1.7844125501551431E-2},{"$f":"IF(ISERROR('B6-FinPos'!L10/'B4-FinPerf RE'!L23),0,('B6-FinPos'!L10/'B4-FinPerf RE'!L23))","v":1.8041535589218935E-2},{"$f":"IF(ISERROR('B6-FinPos'!M10/'B4-FinPerf RE'!M23),0,('B6-FinPos'!M10/'B4-FinPerf RE'!M23))","v":1.6724442527621574E-2}]
["iii. Cost coverage","(Available cash + Investments)/monthly fixed operational expenditure",null,null,null,{"$f":"IF(ISERROR('B7-CFlow'!C42/'SB4'!F46),0,('B7-CFlow'!C42/'SB4'!F46))","v":0},{"$f":"IF(ISERROR('B7-CFlow'!D42/'SB4'!G46),0,('B7-CFlow'!D42/'SB4'!G46))","v":0},{"$f":"IF(ISERROR('B7-CFlow'!K42/'SB4'!H46),0,('B7-CFlow'!K42/'SB4'!H46))","v":0},{"$f":"IF(ISERROR('B7-CFlow'!L42/'SB4'!I46),0,('B7-CFlow'!L42/'SB4'!I46))","v":0},{"$f":"IF(ISERROR('B7-CFlow'!M42/'SB4'!J46),0,('B7-CFlow'!M42/'SB4'!J46))","v":0}]
[{"$f":"head27a","v":"References"}]
["1.  Consumer debtors > 12 months old are excluded from current assets"]
["2. Only include if services provided by the municipality"]
["Calculation data"]
["Debtors > 90 days"]
["Debtors > 12 months recovered"]
["Monthly fixed operational expenditure"]
["Fixed operational expenditure % assumption",null,null,null,null,0.4,{"$f":"$F$47","v":0.4},{"$f":"$F$47","v":0.4},{"$f":"$F$47","v":0.4},{"$f":"$F$47","v":0.4},"develop own assumption as appropriate"]
["Own capex"]
["Borrowing"]

{"sheet":"SB5","index":23,"n_rows":311,"n_cols":15,"rows_kept":311,"cut":false,"hidden":false,"merged":[[1,3,2,3],[62,7,62,9],[1,1,2,1],[108,0,109,0],[1,4,2,4],[1,5,2,5],[246,0,247,0],[246,4,246,12],[154,0,155,0],[108,10,108,12],[154,7,154,9],[1,0,2,0],[200,0,201,0],[1,2,2,2],[200,10,200,12],[154,10,154,12],[1,10,1,12],[62,10,62,12],[200,7,200,9],[108,7,108,9],[62,0,63,0]]}
[{"$f":"muni&\" - \"&ADJB5&\" - \"&Date","v":"LIM332 Greater Letaba - Supporting Table SB5 Adjustments Budget - social, economic and demographic statistics and assumptions - 27 February 2019"}]
["Description of economic indicator","Ref.","Basis of calculation",{"$f":"Head44","v":"2001 Census"},"2007 Survey",{"$f":"Head45","v":"2011 Census"},{"$f":"Head1B","v":"2015/16"},{"$f":"Head1A","v":"2016/17"},{"$f":"Head1","v":"2017/18"},{"$f":"Head2","v":"Budget Year 2018/19"},{"$f":"Head3","v":"2018/19 Medium Term Revenue & Expenditure Framework"}]
[null,null,null,null,null,null,{"$f":"Head5A","v":"Outcome"},"Outcome","Outcome",{"$f":"Head6","v":"Original Budget"},"Outcome","Outcome","Outcome"]
["Demographics"]
["Population",null,"Stats SA",220000,248000,247739,212701,212701,212701,218030,218030]
["Females aged 5 - 14",null,null,33000,49000,22887,36228,36228,36228,24000,24000]
["Males aged 5 - 14",null,null,32000,45000,23365,36655,36655,36655,36655,36655]
["Females aged 15 - 34",null,null,41000,46000,40864,40529,40529,40529,38000,38000]
["Males aged 15 - 34",null,null,35000,42000,36999,36447,36447,36447,34000,34000]
["Unemployment",null,null,79000,66000,260846,18806,18806,18806,30000,30000]
[]
["Monthly Household income ( no. of households)","1, 12"]
["None",null,null,16107,85530,8407,8407,8407,8407,8407,8407]
["R1 - R1 600",null,null,null,null,6301,6301,6301,6301,6301,6901]
["R1 601 - R3 200",null,null,10557,11172,4928,4928,4928,4928,4928,4928]
["R3 201 - R6 400",null,null,null,null,9260,9260,9260,9260,9260,9260]
["R6 401 - R12 800",null,null,14221,17061,15128,15128,15128,15128,16789,16789]
["R12 801 - R25 600",null,null,null,null,12212,12212,12212,12212,12812,12812]
["R25 601 - R51 200",null,null,null,null,3814,3814,3814,3814,3814,3814]
["R52 201 - R102 400",null,null,null,null,2170,2170,2170,2170,2170,2170]
["R102 401 - R204 800",null,null,null,null,1419,1419,1419,1419,1419,1419]
["R204 801 - R409 600",null,null,null,null,630,630,630,630,630,630]
["R409 601 - R819 200",null,null,null,null,76,132,132,132,132,132]
[" > R819 200",null,null,null,null,132,76,76,76,76,76]
[]
[]
["Poverty profiles (no. of households)"]
["< R2 060 per household per month",13,"Selftargeting",null,null,4928,4818,4818,4818,4818,4818]
["Insert description",2]
[]
["Household/demographics (000)"]
["Number of people in municipal area",null,null,null,null,null,212701,212701,212701,212701,212701]
["Number of poor people in municipal area",null,null,null,null,null,152701,152701,152701,152701,152701]
["Number of households in municipal area",null,null,null,null,null,58261,58261,58261,58261,58261]
["Number of poor households in municipal area",null,null,null,null,null,45261,45261,45261,45261,45261]
["Definition of poor household (R per month)",null,null,null,null,null,0,0,0,null,0]
[]
["Housing statistics",3]
["Formal",null,null,57100,56850,20124,20124,20124,20124,27899,27899]
["Informal",null,null,2439,2689,30137,30137,30137,30137,39167,39167]
["Total number of households",null,{"$f":"SUM(C39:C40)","v":0},59539,59539,50261,50261,50261,50261,67066,67066]
["Dwellings provided by municipality",4,null,null,null,4,2,2,2,2,2]
["Dwellings provided by province/s",null,null,null,null,2402,3610,3610,3610,3610,3610]
["Dwellings provided by private sector",5,null,null,null,2,1,1,1,1,1]
["Total new housing dwellings",null,{"$f":"SUM(C42:C44)","v":0},0,0,2408,3613,3613,3613,3613,3613]
[]
["Economic",6]
["Inflation/inflation outlook (CPIX)",null,null,null,null,null,5.7000000000000002E-2,5.6000000000000001E-2,5.6000000000000001E-2]
["Interest rate - borrowing",null,null,null,null,null,0,0,0]
["Interest rate - investment",null,null,null,null,null,5.6000000000000001E-2,5.6000000000000001E-2,5.6000000000000001E-2]
["Remuneration increases",null,null,null,null,null,6.8500000000000005E-2,6.8500000000000005E-2,6.8500000000000005E-2]
["Consumption growth (electricity)",null,null,null,null,null,0.08,0.08,0.08]
["Consumption growth (water)",null,null,null,null,null,0,0,0]
[]
["Collection rates",7]
["Property tax/service charges",null,null,null,null,"%","%","%","%","%","%"]
["Rental of facilities & equipment",null,null,null,null,"%","%","%","%","%","%"]
["Interest - external investments",null,null,null,null,"%","%","%","%","%","%"]
["Interest - debtors",null,null,null,null,"%","%","%","%","%","%"]
["Revenue from agency services",null,null,null,null,"%","%","%","%","%","%"]
[]
["Detail on the provision of municipal services for B10"]
["Total municipal services",null,null,null,{"$f":"Head1B","v":"2015/16"},{"$f":"Head1A","v":"2016/17"},{"$f":"Head1","v":"2017/18"},{"$f":"Head2","v":"Budget Year 2018/19"},null,null,{"$f":"Head3","v":"2018/19 Medium Term Revenue & Expenditure Framework"}]
[null,"Ref.",null,null,{"$f":"Head5A","v":"Outcome"},{"$f":"Head5A","v":"Outcome"},{"$f":"Head5A","v":"Outcome"},{"$f":"Head6","v":"Original Budget"},{"$f":"Head7","v":"Adjusted Budget"},{"$f":"Head8","v":"Full Year Forecast"},{"$f":"Head9","v":"Budget Year 2018/19"},{"$f":"Head10","v":"Budget Year +1 2019/20"},{"$f":"Head11","v":"Budget Year +2 2020/21"}]
[null,null,"Household service targets (000)"]
[null,null,"Water:"]
[null,null,"Piped water inside dwelling",null,{"$f":"E113+E159+E205","v":5948},{"$f":"F113+F159+F205","v":5948},5948,5948,5948,5948,7948,7948,7948]
[null,null,"Piped water inside yard (but not in dwelling)",null,{"$f":"E114+E160+E206","v":20320},20320,20320,20320,20320,20320,21320,21320,21320]
[null,8,"Using public tap (at least min.service level)",null,17276,17276,17276,17276,17276,17276,19277,19277,19277]
[null,10,"Other water supply (at least min.service level)"]
[null,null,"Minimum Service Level and Above sub-total",null,{"$f":"SUM(E67:E70)","v":43544},{"$f":"SUM(F67:F70)","v":43544},43544,43544,43544,43544,48545,48545,48545]
[null,9,"Using public tap (< min.service level)",null,{"$f":"E118+E164+E210","v":7560},7560,7560,7560,7560,7560,9462,9462,9258.2142857142899]
[null,10,"Other water supply (< min.service level)",null,0,0,0,0,0,0,9060,9060,8089.2857142857001]
[null,null,"No water supply",null,7158,7158,7158,7158,7158,7158,0,0,766.92857142856997]
[null,null,"Below Minimum Service Level sub-total",null,{"$f":"SUM(E72:E74)","v":14718},{"$f":"SUM(F72:F74)","v":14718},14718,14718,14718,14718,18522,18522,18114.428571428558]
[null,null,"Total number of households",null,{"$f":"E71+E75","v":58262},{"$f":"F71+F75","v":58262},58262,58262,58262,58262,67067,67067,66659.428571428551]
[null,null,"Sanitation/sewerage:"]
[null,null,"Flush toilet (connected to sewerage)",null,{"$f":"E124+E170+E216","v":9458},9458,9458,9458,9458,9458,9003,9003,9051.75]
[null,null,"Flush toilet (with septic tank)",null,7510,7510,7510,7510,7510,7510,8011,8011,7957.3214285714303]
[null,null,"Chemical toilet",null,11477,11477,11477,11477,11477,11477,12012,12012,11954.6785714286]
[null,null,"Pit toilet (ventilated)",null,22409,22409,22409,22409,22409,22409,21012,21012,21161.678571428602]
[null,null,"Other toilet provisions (> min.service level)",null,0,0,0,0,0,0,0,0,0]
[null,null,"Minimum Service Level and Above sub-total",null,{"$f":"SUM(E78:E82)","v":50854},{"$f":"SUM(F78:F82)","v":50854},50854,50854,50854,50854,50038,50038,50125.428571428631]
[null,null,"Bucket toilet",null,{"$f":"E130+E176+E222","v":336},336,336,336,336,336,1000,1000,1000]
[null,null,"Other toilet provisions (< min.service level)",null,791,791,791,791,791,791,2011,2011,2011]
[null,null,"No toilet provisions",null,6281,6281,6281,6281,6281,6281,8010,8010,8010]
[null,null,"Below Minimum Service Level sub-total",null,{"$f":"SUM(E84:E86)","v":7408},{"$f":"SUM(F84:F86)","v":7408},7408,7408,7408,7408,11021,11021,11021]
[null,null,"Total number of households",null,{"$f":"E83+E87","v":58262},{"$f":"F83+F87","v":58262},58262,58262,58262,58262,61059,61059,61146.428571428631]
[null,null,"Energy:"]
[null,null,"Electricity (at least min.service level)",null,{"$f":"E136+E182+E228","v":53260},53260,53260,53260,53260,53260,56260,56260,56260]
[null,null,"Electricity - prepaid (min.service level)",null,2002,2002,2002,2002,2002,2002,6002,6002,6002]
[null,null,"Minimum Service Level and Above sub-total",null,{"$f":"SUM(E90:E91)","v":55262},{"$f":"SUM(F90:F91)","v":55262},55262,55262,55262,55262,62262,62262,62262]
[null,null,"Electricity (< min.service level)",null,{"$f":"E139+E185+E231","v":0},0,0,0,0,0,0,0,0]
[null,null,"Electricity - prepaid (< min. service level)",null,3000,3000,3000,3000,3000,3000,4805,4805,4805]
[null,null,"Other energy sources",null,0,0,0,0,0,0,0,0,0]
[null,null,"Below Minimum Service Level sub-total",null,{"$f":"SUM(E93:E95)","v":3000},{"$f":"SUM(F93:F95)","v":3000},3000,3000,3000,3000,4805,4805,4805]
[null,null,"Total number of households",null,{"$f":"E92+E96","v":58262},{"$f":"F92+F96","v":58262},58262,58262,58262,58262,67067,67067,67067]
[null,null,"Refuse:"]
[null,null,"Removed at least once a week",null,{"$f":"E145+E191+E237","v":4954},4954,4954,4954,4954,4954,7454,7454,7454]
[null,null,"Minimum Service Level and Above sub-total",null,{"$f":"SUM(E99)","v":4954},{"$f":"SUM(F99)","v":4954},4954,4954,4954,4954,7454,7454,7454]
[null,null,"Removed less frequently than once a week",null,478,478,478,478,478,478,978,978,978]
[null,null,"Using communal refuse dump",null,651,651,651,651,651,651,1051,1051,1051]
[null,null,"Using own refuse dump",null,42815,42815,42815,42815,42815,42815,45815,45815,45815]
[null,null,"Other rubbish disposal",null,8554,8554,8554,8554,8554,8554,10554,10554,10554]
[null,null,"No rubbish disposal",null,810,810,810,810,810,810,1215,1215,1215]
[null,null,"Below Minimum Service Level sub-total",null,{"$f":"SUM(E101:E105)","v":53308},53308,53308,53308,53308,53308,59613,59613,59613]
[null,null,"Total number of households",null,{"$f":"E100+E106","v":58262},{"$f":"F100+F106","v":58262},58262,58262,58262,58262,67067,67067,67067]
[]
["Municipal in-house services",null,null,null,{"$f":"Head1B","v":"2015/16"},{"$f":"Head1A","v":"2016/17"},{"$f":"Head1","v":"2017/18"},{"$f":"Head2","v":"Budget Year 2018/19"},null,null,{"$f":"Head3","v":"2018/19 Medium Term Revenue & Expenditure Framework"}]
[null,"Ref.",null,null,{"$f":"Head5A","v":"Outcome"},{"$f":"Head5A","v":"Outcome"},{"$f":"Head5A","v":"Outcome"},{"$f":"Head6","v":"Original Budget"},{"$f":"Head7","v":"Adjusted Budget"},{"$f":"Head8","v":"Full Year Forecast"},{"$f":"Head9","v":"Budget Year 2018/19"},{"$f":"Head10","v":"Budget Year +1 2019/20"},{"$f":"Head11","v":"Budget Year +2 2020/21"}]
[null,null,"Household service targets (000)"]
[null,null,"Water:"]
[null,null,"Piped water inside dwelling",null,5948,5948,5948,5948,5948,5948,7948,7948,7948]
[null,null,"Piped water inside yard (but not in dwelling)",null,20320,20320,20320,20320,20320,20320,21320,21320,21320]
[null,8,"Using public tap (at least min.service level)",null,17276,17276,17276,17276,17276,17276,19277,19277,19277]
[null,10,"Other water supply (at least min.service level)"]
[null,null,"Minimum Service Level and Above sub-total",null,{"$f":"SUM(E113:E116)","v":43544},{"$f":"SUM(F113:F116)","v":43544},43544,43544,43544,43544,48545,48545,48545]
[null,9,"Using public tap (< min.service level)",null,7560,7560,7560,7560,7560,7560,9462,9462,9258.2142857142899]
[null,10,"Other water supply (< min.service level)",null,0,0,0,0,0,0,9060,9060,8089.2857142857001]
[null,null,"No water supply",null,7158,7158,7158,7158,7158,7158,0,0,766.92857142856997]
[null,null,"Below Minimum Service Level sub-total",null,{"$f":"SUM(E118:E120)","v":14718},{"$f":"SUM(F118:F120)","v":14718},14718,14718,14718,14718,18522,18522,18114.428571428558]
[null,null,"Total number of households",null,{"$f":"E117+E121","v":58262},{"$f":"F117+F121","v":58262},58262,58262,58262,58262,67067,67067,66659.428571428551]
[null,null,"Sanitation/sewerage:"]
[null,null,"Flush toilet (connected to sewerage)",null,9458,9458,9458,9458,9458,9458,9003,9003,9051.75]
[null,null,"Flush toilet (with septic tank)",null,7510,7510,7510,7510,7510,7510,8011,8011,7957.3214285714303]
[null,null,"Chemical toilet",null,11477,11477,11477,11477,11477,11477,12012,12012,11954.6785714286]
[null,null,"Pit toilet (ventilated)",null,22409,22409,22409,22409,22409,22409,21012,21012,21161.678571428602]
[null,null,"Other toilet provisions (> min.service level)"]
[null,null,"Minimum Service Level and Above sub-total",null,{"$f":"SUM(E124:E128)","v":50854},{"$f":"SUM(F124:F128)","v":50854},50854,50854,50854,50854,50038,50038,50125.428571428631]
[null,null,"Bucket toilet",null,336,336,336,336,336,336,1000,1000,1000]
[null,null,"Other toilet provisions (< min.service level)",null,791,791,791,791,791,791,2011,2011,2011]
[null,null,"No toilet provisions",null,6281,6281,6281,6281,6281,6281,8010,8010,8010]
[null,null,"Below Minimum Service Level sub-total",null,{"$f":"SUM(E130:E132)","v":7408},{"$f":"SUM(F130:F132)","v":7408},7408,7408,7408,7408,11021,11021,11021]
[null,null,"Total number of households",null,{"$f":"E129+E133","v":58262},{"$f":"F129+F133","v":58262},58262,58262,58262,58262,61059,61059,61146.428571428631]
[null,null,"Energy:"]
[null,null,"Electricity (at least min.service level)",null,53260,53260,53260,53260,53260,53260,56260,56260,56260]
[null,null,"Electricity - prepaid (min.service level)",null,2002,2002,2002,2002,2002,2002,6002,6002,6002]
[null,null,"Minimum Service Level and Above sub-total",null,{"$f":"SUM(E136:E137)","v":55262},{"$f":"SUM(F136:F137)","v":55262},55262,55262,55262,55262,62262,62262,62262]
[null,null,"Electricity (< min.service level)",null,0,0,0,0,0,0,0,0,0]
[null,null,"Electricity - prepaid (< min. service level)",null,3000,3000,3000,3000,3000,3000,4805,4805,4805]
[null,null,"Other energy sources",null,0,0,0,0,0,0,0,0,0]
[null,null,"Below Minimum Service Level sub-total",null,{"$f":"SUM(E139:E141)","v":3000},{"$f":"SUM(F139:F141)","v":3000},3000,3000,3000,3000,4805,4805,4805]
[null,null,"Total number of households",null,{"$f":"E138+E142","v":58262},{"$f":"F138+F142","v":58262},58262,58262,58262,58262,67067,67067,67067]
[null,null,"Refuse:"]
[null,null,"Removed at least once a week",null,4954,4954,4954,4954,4954,4954,7454,7454,7454]
[null,null,"Minimum Service Level and Above sub-total",null,{"$f":"SUM(E145)","v":4954},{"$f":"SUM(F145)","v":4954},4954,4954,4954,4954,7454,7454,7454]
[null,null,"Removed less frequently than once a week",null,478,478,478,478,478,478,978,978,978]
[null,null,"Using communal refuse dump",null,651,651,651,651,651,651,1051,1051,1051]
[null,null,"Using own refuse dump",null,42815,42815,42815,42815,42815,42815,45815,45815,45815]
[null,null,"Other rubbish disposal",null,8554,8554,8554,8554,8554,8554,10554,10554,10554]
[null,null,"No rubbish disposal",null,810,810,810,810,810,810,1215,1215,1215]
[null,null,"Below Minimum Service Level sub-total",null,{"$f":"SUM(E147:E151)","v":53308},53308,53308,53308,53308,53308,59613,59613,59613]
[null,null,"Total number of households",null,{"$f":"E146+E152","v":58262},{"$f":"F146+F152","v":58262},58262,58262,58262,58262,67067,67067,67067]
[]
["Municipal entity services",null,null,null,{"$f":"Head1B","v":"2015/16"},{"$f":"Head1A","v":"2016/17"},{"$f":"Head1","v":"2017/18"},{"$f":"Head2","v":"Budget Year 2018/19"},null,null,{"$f":"Head3","v":"2018/19 Medium Term Revenue & Expenditure Framework"}]
[null,"Ref.",null,null,{"$f":"Head5A","v":"Outcome"},{"$f":"Head5A","v":"Outcome"},{"$f":"Head5A","v":"Outcome"},{"$f":"Head6","v":"Original Budget"},{"$f":"Head7","v":"Adjusted Budget"},{"$f":"Head8","v":"Full Year Forecast"},{"$f":"Head9","v":"Budget Year 2018/19"},{"$f":"Head10","v":"Budget Year +1 2019/20"},{"$f":"Head11","v":"Budget Year +2 2020/21"}]
[null,null,"Household service targets (000)"]
["Name of municipal entity",null,"Water:"]
[null,null,"Piped water inside dwelling"]
[null,null,"Piped water inside yard (but not in dwelling)"]
[null,8,"Using public tap (at least min.service level)"]
[null,10,"Other water supply (at least min.service level)"]
[null,null,"Minimum Service Level and Above sub-total",null,{"$f":"SUM(E159:E162)","v":0},{"$f":"SUM(F159:F162)","v":0},0,0,0,0,0,0,0]
[null,9,"Using public tap (< min.service level)"]
[null,10,"Other water supply (< min.service level)"]
[null,null,"No water supply"]
[null,null,"Below Minimum Service Level sub-total",null,{"$f":"SUM(E164:E166)","v":0},{"$f":"SUM(F164:F166)","v":0},0,0,0,0,0,0,0]
[null,null,"Total number of households",null,{"$f":"E163+E167","v":0},{"$f":"F163+F167","v":0},0,0,0,0,0,0,0]
["Name of municipal entity",null,"Sanitation/sewerage:"]
[null,null,"Flush toilet (connected to sewerage)"]
[null,null,"Flush toilet (with septic tank)"]
[null,null,"Chemical toilet"]
[null,null,"Pit toilet (ventilated)"]
[null,null,"Other toilet provisions (> min.service level)"]
[null,null,"Minimum Service Level and Above sub-total",null,{"$f":"SUM(E170:E174)","v":0},{"$f":"SUM(F170:F174)","v":0},0,0,0,0,0,0,0]
[null,null,"Bucket toilet"]
[null,null,"Other toilet provisions (< min.service level)"]
[null,null,"No toilet provisions"]
[null,null,"Below Minimum Service Level sub-total",null,{"$f":"SUM(E176:E178)","v":0},{"$f":"SUM(F176:F178)","v":0},0,0,0,0,0,0,0]
[null,null,"Total number of households",null,{"$f":"E175+E179","v":0},{"$f":"F175+F179","v":0},0,0,0,0,0,0,0]
["Name of municipal entity",null,"Energy:"]
[null,null,"Electricity (at least min.service level)"]
[null,null,"Electricity - prepaid (min.service level)"]
[null,null,"Minimum Service Level and Above sub-total",null,{"$f":"SUM(E182:E183)","v":0},{"$f":"SUM(F182:F183)","v":0},0,0,0,0,0,0,0]
[null,null,"Electricity (< min.service level)"]
[null,null,"Electricity - prepaid (< min. service level)"]
[null,null,"Other energy sources"]
[null,null,"Below Minimum Service Level sub-total",null,{"$f":"SUM(E185:E187)","v":0},{"$f":"SUM(F185:F187)","v":0},0,0,0,0,0,0,0]
[null,null,"Total number of households",null,{"$f":"E184+E188","v":0},{"$f":"F184+F188","v":0},0,0,0,0,0,0,0]
["Name of municipal entity",null,"Refuse:"]
[null,null,"Removed at least once a week"]
[null,null,"Minimum Service Level and Above sub-total",null,{"$f":"SUM(E191)","v":0},{"$f":"SUM(F191)","v":0},0,0,0,0,0,0,0]
[null,null,"Removed less frequently than once a week"]
[null,null,"Using communal refuse dump"]
[null,null,"Using own refuse dump"]
[null,null,"Other rubbish disposal"]
[null,null,"No rubbish disposal"]
[null,null,"Below Minimum Service Level sub-total",null,{"$f":"SUM(E193:E197)","v":0},0,0,0,0,0,0,0,0]
[null,null,"Total number of households",null,{"$f":"E192+E198","v":0},{"$f":"F192+F198","v":0},0,0,0,0,0,0,0]
[]
["Services provided by 'external mechanisms'",null,null,null,{"$f":"Head1B","v":"2015/16"},{"$f":"Head1A","v":"2016/17"},{"$f":"Head1","v":"2017/18"},{"$f":"Head2","v":"Budget Year 2018/19"},null,null,{"$f":"Head3","v":"2018/19 Medium Term Revenue & Expenditure Framework"}]
[null,"Ref.",null,null,{"$f":"Head5A","v":"Outcome"},{"$f":"Head5A","v":"Outcome"},{"$f":"Head5A","v":"Outcome"},{"$f":"Head6","v":"Original Budget"},{"$f":"Head7","v":"Adjusted Budget"},{"$f":"Head8","v":"Full Year Forecast"},{"$f":"Head9","v":"Budget Year 2018/19"},{"$f":"Head10","v":"Budget Year +1 2019/20"},{"$f":"Head11","v":"Budget Year +2 2020/21"}]
["Names of service providers",null,"Household service targets (000)"]
[null,null,"Water:"]
[null,null,"Piped water inside dwelling"]
[null,null,"Piped water inside yard (but not in dwelling)"]
[null,8,"Using public tap (at least min.service level)"]
[null,10,"Other water supply (at least min.service level)"]
[null,null,"Minimum Service Level and Above sub-total",null,{"$f":"SUM(E205:E208)","v":0},{"$f":"SUM(F205:F208)","v":0},0,0,0,0,0,0,0]
[null,9,"Using public tap (< min.service level)"]
[null,10,"Other water supply (< min.service level)"]
[null,null,"No water supply"]
[null,null,"Below Minimum Service Level sub-total",null,{"$f":"SUM(E210:E212)","v":0},{"$f":"SUM(F210:F212)","v":0},0,0,0,0,0,0,0]
[null,null,"Total number of households",null,{"$f":"E209+E213","v":0},{"$f":"F209+F213","v":0},0,0,0,0,0,0,0]
["Names of service providers",null,"Sanitation/sewerage:"]
[null,null,"Flush toilet (connected to sewerage)"]
[null,null,"Flush toilet (with septic tank)"]
[null,null,"Chemical toilet"]
[null,null,"Pit toilet (ventilated)"]
[null,null,"Other toilet provisions (> min.service level)"]
[null,null,"Minimum Service Level and Above sub-total",null,{"$f":"SUM(E216:E220)","v":0},{"$f":"SUM(F216:F220)","v":0},0,0,0,0,0,0,0]
[null,null,"Bucket toilet"]
[null,null,"Other toilet provisions (< min.service level)"]
[null,null,"No toilet provisions"]
[null,null,"Below Minimum Service Level sub-total",null,{"$f":"SUM(E222:E224)","v":0},{"$f":"SUM(F222:F224)","v":0},0,0,0,0,0,0,0]
[null,null,"Total number of households",null,{"$f":"E221+E225","v":0},{"$f":"F221+F225","v":0},0,0,0,0,0,0,0]
["Names of service providers",null,"Energy:"]
[null,null,"Electricity (at least min.service level)"]
[null,null,"Electricity - prepaid (min.service level)"]
[null,null,"Minimum Service Level and Above sub-total",null,{"$f":"SUM(E228:E229)","v":0},{"$f":"SUM(F228:F229)","v":0},0,0,0,0,0,0,0]
[null,null,"Electricity (< min.service level)"]
[null,null,"Electricity - prepaid (< min. service level)"]
[null,null,"Other energy sources"]
[null,null,"Below Minimum Service Level sub-total",null,{"$f":"SUM(E231:E233)","v":0},{"$f":"SUM(F231:F233)","v":0},0,0,0,0,0,0,0]
[null,null,"Total number of households",null,{"$f":"E230+E234","v":0},{"$f":"F230+F234","v":0},0,0,0,0,0,0,0]
["Names of service providers",null,"Refuse:"]
[null,null,"Removed at least once a week"]
[null,null,"Minimum Service Level and Above sub-total",null,{"$f":"SUM(E237)","v":0},{"$f":"SUM(F237)","v":0},0,0,0,0,0,0,0]
[null,null,"Removed less frequently than once a week"]
[null,null,"Using communal refuse dump"]
[null,null,"Using own refuse dump"]
[null,null,"Other rubbish disposal"]
[null,null,"No rubbish disposal"]
[null,null,"Below Minimum Service Level sub-total",null,{"$f":"SUM(E239:E243)","v":0},0,0,0,0,0,0,0,0]
[null,null,"Total number of households",null,{"$f":"E238+E244","v":0},{"$f":"F238+F244","v":0},0,0,0,0,0,0,0]
[]
["Detail of Free Basic Services (FBS) provided",null,null,null,{"$f":"Head2","v":"Budget Year 2018/19"},null,null,null,null,null,null,null,null,{"$f":"Head10","v":"Budget Year +1 2019/20"},{"$f":"Head11","v":"Budget Year +2 2020/21"}]
[null,null,null,null,{"$f":"Head6","v":"Original Budget"},{"$f":"Head54","v":"Prior Adjusted"},{"$f":"Head51","v":"Accum. Funds"},{"$f":"Head52","v":"Multi-year capital"},{"$f":"Head53","v":"Unfore. Unavoid."},{"$f":"Head55","v":"Nat. or Prov. Govt"},{"$f":"Head50","v":"Other Adjusts."},{"$f":"Head56","v":"Total Adjusts."},{"$f":"Head7","v":"Adjusted Budget"},{"$f":"Head7","v":"Adjusted Budget"},{"$f":"Head7","v":"Adjusted Budget"}]
["Electricity","Ref.","Location of households for each type of FBS"]
["List type of FBS service",null,"Formal settlements -  (50 kwh per indigent household per month R '000)",null,8000,null,null,null,null,null,null,{"$f":"SUM(G250:K250)","v":0},{"$f":"IF(F250=0,E250+L250,F250+L250)","v":8000},8000,8000]
[null,null,"Number of HH receiving this type of FBS",null,null,null,null,null,null,null,null,{"$f":"SUM(G251:K251)","v":0},0]
[null,null,"Informal settlements (R '000)",null,null,null,null,null,null,null,null,0,0]
[null,null,"Number of HH receiving this type of FBS",null,null,null,null,null,null,null,null,0,0]
[null,null,"Informal settlements targeted for upgrading (R '000)",null,null,null,null,null,null,null,null,0,0]
[null,null,"Number of HH receiving this type of FBS",null,null,null,null,null,null,null,null,0,0]
[null,null,"Living in informal backyard rental agreement (R '000)",null,null,null,null,null,null,null,null,0,0]
[null,null,"Number of HH receiving this type of FBS",null,null,null,null,null,null,null,null,0,0]
[null,null,"Other (R '000)",null,null,null,null,null,null,null,null,0,0]
[null,null,"Number of HH receiving this type of FBS",null,null,null,null,null,null,null,null,0,0]
[null,null,"Total cost of FBS - Electricity for informal settlements",null,{"$f":"E252+E254+E256+E258","v":0},{"$f":"F252+F254+F256+F258","v":0},0,0,0,0,0,{"$f":"L252+L254+L256+L258","v":0},0,{"$f":"N252+N254+N256+N258","v":0},0]
["Water","Ref.","Location of households for each type of FBS"]
["List type of FBS service",null,"Formal settlements -  (6 kilolitre per indigent household per month R '000)",null,0,null,null,null,null,null,null,{"$f":"SUM(G262:K262)","v":0},{"$f":"IF(F262=0,E262+L262,F262+L262)","v":0}]
[null,null,"Number of HH receiving this type of FBS",null,120,null,null,null,null,null,null,0,120,120,120]
[null,null,"Informal settlements (R '000)",null,null,null,null,null,null,null,null,0,0]
[null,null,"Number of HH receiving this type of FBS",null,null,null,null,null,null,null,null,0,0]
[null,null,"Informal settlements targeted for upgrading (R '000)",null,null,null,null,null,null,null,null,{"$f":"SUM(G266:K266)","v":0},0]
[null,null,"Number of HH receiving this type of FBS",null,null,null,null,null,null,null,null,0,0]
[null,null,"Living in informal backyard rental agreement (R '000)",null,null,null,null,null,null,null,null,0,0]
[null,null,"Number of HH receiving this type of FBS",null,null,null,null,null,null,null,null,0,0]
[null,null,"Other (R '000)",null,null,null,null,null,null,null,null,0,0]
[null,null,"Number of HH receiving this type of FBS",null,null,null,null,null,null,null,null,0,0]
[null,null,"Total cost of FBS - Water  for informal settlements",null,{"$f":"E264+E266+E268+E270","v":0},{"$f":"F264+F266+F268+F270","v":0},0,0,0,0,0,0,0,{"$f":"N264+N266+N268+N270","v":0},{"$f":"O264+O266+O268+O270","v":0}]
["Sanitation","Ref.","Location of households for each type of FBS"]
["List type of FBS service",null,"Formal settlements -  (free sanitation service to indigent households R '000)",null,0,null,null,null,null,null,null,{"$f":"SUM(G274:K274)","v":0},{"$f":"IF(F274=0,E274+L274,F274+L274)","v":0},0,0]
[null,null,"Number of HH receiving this type of FBS",null,120,null,null,null,null,null,null,0,120,120,120]
[null,null,"Informal settlements (R '000)",null,null,null,null,null,null,null,null,0,0]
[null,null,"Number of HH receiving this type of FBS",null,null,null,null,null,null,null,null,0,0]
[null,null,"Informal settlements targeted for upgrading (R '000)",null,null,null,null,null,null,null,null,0,0]
[null,null,"Number of HH receiving this type of FBS",null,null,null,null,null,null,null,null,0,0]
[null,null,"Living in informal backyard rental agreement (R '000)",null,null,null,null,null,null,null,null,0,0]
[null,null,"Number of HH receiving this type of FBS",null,null,null,null,null,null,null,null,0,0]
[null,null,"Other (R '000)",null,null,null,null,null,null,null,null,0,0]
[null,null,"Number of HH receiving this type of FBS",null,null,null,null,null,null,null,null,0,0]
[null,null,"Total cost of FBS - Sanitation for informal settlements",null,{"$f":"E276+E278+E280+E282","v":0},{"$f":"F276+F278+F280+F282","v":0},0,0,0,0,0,0,0,{"$f":"N276+N278+N280+N282","v":0},{"$f":"O276+O278+O280+O282","v":0}]
["Refuse Removal","Ref.","Location of households for each type of FBS"]
["List type of FBS service",null,"Formal settlements -  (removed once a week to indigent households R '000)",null,0,null,null,null,null,null,null,{"$f":"SUM(G286:K286)","v":0},{"$f":"IF(F286=0,E286+L286,F286+L286)","v":0},0,0]
[null,null,"Number of HH receiving this type of FBS",null,120,null,null,null,null,null,null,0,120,120,120]
[null,null,"Informal settlements (R '000)",null,null,null,null,null,null,null,null,0,0]
[null,null,"Number of HH receiving this type of FBS",null,null,null,null,null,null,null,null,0,0]
[null,null,"Informal settlements targeted for upgrading (R '000)",null,null,null,null,null,null,null,null,0,0]
[null,null,"Number of HH receiving this type of FBS",null,null,null,null,null,null,null,null,0,0]
[null,null,"Living in informal backyard rental agreement (R '000)",null,null,null,null,null,null,null,null,0,0]
[null,null,"Number of HH receiving this type of FBS",null,null,null,null,null,null,null,null,0,0]
[null,null,"Other (R '000)",null,null,null,null,null,null,null,null,0,0]
[null,null,"Number of HH receiving this type of FBS",null,null,null,null,null,null,null,null,0,0]
[null,null,"Total cost of FBS - Refuse Removal for informal settlements",null,{"$f":"E288+E290+E292+E294","v":0},{"$f":"F288+F290+F292+F294","v":0},0,0,0,0,0,0,0,{"$f":"N288+N290+N292+N294","v":0},{"$f":"O288+O290+O292+O294","v":0}]
[]
[{"$f":"head27a","v":"References"}]
["1. Monthly household income threshold. Should include all sources of income."]
["2. Show the poverty analysis the municipality uses to determine its indigents policy and the provision of services"]
["3. Include total of all housing units within the municipality"]
["4. Number of subsidised dwellings to be constructed by the municipality under agency agreement with province"]
["5. Provide estimate based on building approval information. Include any non-subsidised dwellings constructed by the municipality"]
["6. Insert actual or estimated % increases assumed as a basis for budget calculations"]
["7. Insert actual or estimated % collection rate assumed as a basis for budget calculations for each revenue group"]
["8. Stand distance <= 200m from dwelling"]
["9. Stand distance > 200m from dwelling"]
["10. Borehole, spring, rain-water tank etc."]
["11. Must agree to total number of households in municipal area"]
["12. Household income categories assume an average 4 person household. Stats SA - Census 2011 Questionnaire"]
["13. Based on National poverty line of R515 per capita per month (2008 prices), assuming an average household size of 4 persons"]

{"sheet":"SB6","index":24,"n_rows":71,"n_cols":11,"rows_kept":71,"cut":false,"hidden":false,"merged":[[1,1,2,1],[1,2,2,2]]}
[{"$f":"muni &\" - \"&ADJB6&\" - \"&Date","v":"LIM332 Greater Letaba - Supporting Table SB6 Adjustments Budget - funding measurement - 27 February 2019"}]
[{"$f":"desc","v":"Description"},{"$f":"head27","v":"Ref"},"MFMA section",{"$f":"Head1B","v":"2015/16"},{"$f":"Head1A","v":"2016/17"},{"$f":"Head1","v":"2017/18"},{"$f":"Head3a","v":"Medium Term Revenue and Expenditure Framework"}]
["R thousands",null,null,{"$f":"Head5","v":"Audited Outcome"},{"$f":"Head5","v":"Audited Outcome"},{"$f":"Head5","v":"Audited Outcome"},{"$f":"Head6","v":"Original Budget"},{"$f":"Head54","v":"Prior Adjusted"},{"$f":"Head7","v":"Adjusted Budget"},{"$f":"Head10","v":"Budget Year +1 2019/20"},{"$f":"Head11","v":"Budget Year +2 2020/21"}]
["Funding measures"]
["Cash/cash equivalents at the year end - R'000",1,"18(1)b",60714362,55932345,13671000,{"$f":"'B7-CFlow'!C42","v":20650142.486999959},{"$f":"'B7-CFlow'!D42","v":0},{"$f":"'B7-CFlow'!K42","v":4026142.4869999588},{"$f":"'B7-CFlow'!L42","v":5635781.400000006},{"$f":"'B7-CFlow'!M42","v":5918631.599999994}]
["Cash + investments at the yr end less applications - R'000",2,"18(1)b",49163433,47066386,13671000,{"$f":"'B8-ResRecon'!C21","v":5084391.8822319955},{"$f":"'B8-ResRecon'!D21","v":0},{"$f":"'B8-ResRecon'!K21","v":-14182751.117768005},{"$f":"'B8-ResRecon'!L21","v":-12233569.117768001},{"$f":"'B8-ResRecon'!M21","v":-11229247.633618001}]
["Cash year end/monthly employee/supplier payments",3,"18(1)b",5.4795374257331666,4.1261646714385822,4.1261646714385822,{"$f":"'SB4'!F39","v":0},{"$f":"'SB4'!G39","v":0},{"$f":"'SB4'!H39","v":0},{"$f":"'SB4'!I39","v":0},{"$f":"'SB4'!J39","v":0}]
["Surplus/(Deficit) excluding depreciation offsets: R'000",4,"18(1)",156204427,90079183,105276193,{"$f":"'B4-FinPerf RE'!C43+'SB2'!C52","v":179269318.86760002},{"$f":"'B4-FinPerf RE'!D43+'SB2'!D52","v":0},{"$f":"'B4-FinPerf RE'!K43+'SB2'!K52","v":173662063.16760004},{"$f":"'B4-FinPerf RE'!L43+'SB2'!L52","v":174389014.72235},{"$f":"'B4-FinPerf RE'!M43+'SB2'!M52","v":192010351.60434276}]
["Service charge rev % change - macro CPIX target exclusive",5,"18(1)a,(2)",-9.5002581738838299E-2,0.11230651896318339,0.12820000000000001,{"$f":"IF(ISERROR(((G36/G37)-1)-G35),0,(((G36/G37)-1)-G35))","v":0},{"$f":"IF(ISERROR(((H36/H37)-1)-H35),0,(((H36/H37)-1)-H35))","v":0},{"$f":"IF(ISERROR(((I36/I37)-1)-I35),0,(((I36/I37)-1)-I35))","v":0},{"$f":"IF(ISERROR(((J36/J37)-1)-J35),0,(((J36/J37)-1)-J35))","v":-8.0933285522138021E-2},{"$f":"IF(ISERROR(((K36/K37)-1)-K35),0,(((K36/K37)-1)-K35))","v":5.0000080353398979E-3}]
["Cash receipts % of Ratepayer & Other revenue",6,"18(1)a,(2)",{"$f":"IF(ISERROR(D40/D41),0,(D40/D41))","v":0},{"$f":"IF(ISERROR(E40/E41),0,(E40/E41))","v":0},0,0.56328766652640994,0,0.68889442494541442,0.62442046022880271,0.62441102613771882]
["Debt impairment expense as a % of total billable revenue",7,"18(1)a,(2)",0.43427004189594132,0.95576697745912331,null,{"$f":"IF(ISERROR('B4-FinPerf RE'!C28/(SUM('B4-FinPerf RE'!C7:C13))),0,('B4-FinPerf RE'!C28/(SUM('B4-FinPerf RE'!C7:C13))))","v":6.0927013592195371E-2},{"$f":"IF(ISERROR('B4-FinPerf RE'!D28/(SUM('B4-FinPerf RE'!D7:D13))),0,('B4-FinPerf RE'!D28/(SUM('B4-FinPerf RE'!D7:D13))))","v":0},{"$f":"IF(ISERROR('B4-FinPerf RE'!K28/(SUM('B4-FinPerf RE'!K7:K13))),0,('B4-FinPerf RE'!K28/(SUM('B4-FinPerf RE'!K7:K13))))","v":3.8721855811652335E-2},{"$f":"IF(ISERROR('B4-FinPerf RE'!L28/(SUM('B4-FinPerf RE'!L7:L13))),0,('B4-FinPerf RE'!L28/(SUM('B4-FinPerf RE'!L7:L13))))","v":4.2050621231138195E-2},{"$f":"IF(ISERROR('B4-FinPerf RE'!M28/(SUM('B4-FinPerf RE'!M7:M13))),0,('B4-FinPerf RE'!M28/(SUM('B4-FinPerf RE'!M7:M13))))","v":4.2050619915847146E-2}]
["Capital payments % of capital expenditure",8,"18(1)c;19",0.99064590163512134,0.9110449884761086,0.94059999999999999,{"$f":"IF(ISERROR(-'B7-CFlow'!C28/'B5-Capex'!C65),0,(-'B7-CFlow'!C28/'B5-Capex'!C65))","v":0.80931262745123811},{"$f":"IF(ISERROR(-'B7-CFlow'!D28/'B5-Capex'!D65),0,(-'B7-CFlow'!D28/'B5-Capex'!D65))","v":0},{"$f":"IF(ISERROR(-'B7-CFlow'!E28/'B5-Capex'!E65),0,(-'B7-CFlow'!E28/'B5-Capex'!E65))","v":0},{"$f":"IF(ISERROR(-'B7-CFlow'!F28/'B5-Capex'!F65),0,(-'B7-CFlow'!F28/'B5-Capex'!F65))","v":0},{"$f":"IF(ISERROR(-'B7-CFlow'!G28/'B5-Capex'!G65),0,(-'B7-CFlow'!G28/'B5-Capex'!G65))","v":0}]
["Borrowing receipts % of capital expenditure (excl. transfers)",9,"18(1)c",0,0,0,{"$f":"IF(ISERROR('SB4'!F9),0,('SB4'!F9))","v":0},{"$f":"IF(ISERROR('SB4'!G9),0,('SB4'!G9))","v":0},{"$f":"IF(ISERROR('SB4'!H9),0,('SB4'!H9))","v":0},{"$f":"IF(ISERROR('SB4'!I9),0,('SB4'!I9))","v":0},{"$f":"IF(ISERROR('SB4'!J9),0,('SB4'!J9))","v":0}]
["Grants % of Govt. legislated/gazetted allocations",10,"18(1)a",1,1,1,{"$f":"IF(ISERROR(('B4-FinPerf RE'!C20+'B4-FinPerf RE'!C40)/('SB6'!G38+'SB6'!G39)),0,(('B4-FinPerf RE'!C20+'B4-FinPerf RE'!C40)/('SB6'!G38+'SB6'!G39)))","v":0},{"$f":"IF(ISERROR(('B4-FinPerf RE'!D20+'B4-FinPerf RE'!D40)/('SB6'!H38+'SB6'!H39)),0,(('B4-FinPerf RE'!D20+'B4-FinPerf RE'!D40)/('SB6'!H38+'SB6'!H39)))","v":0},{"$f":"IF(ISERROR(('B4-FinPerf RE'!K20+'B4-FinPerf RE'!K40)/('SB6'!I38+'SB6'!I39)),0,(('B4-FinPerf RE'!K20+'B4-FinPerf RE'!K40)/('SB6'!I38+'SB6'!I39)))","v":0},{"$f":"IF(ISERROR(('B4-FinPerf RE'!L20+'B4-FinPerf RE'!L40)/('SB6'!J38+'SB6'!J39)),0,(('B4-FinPerf RE'!L20+'B4-FinPerf RE'!L40)/('SB6'!J38+'SB6'!J39)))","v":0},{"$f":"IF(ISERROR(('B4-FinPerf RE'!M20+'B4-FinPerf RE'!M40)/('SB6'!K38+'SB6'!K39)),0,(('B4-FinPerf RE'!M20+'B4-FinPerf RE'!M40)/('SB6'!K38+'SB6'!K39)))","v":0}]
["Current consumer debtors % change - incr(decr)",11,"18(1)a",1.111,7.4999999999999997E-2,null,null,null,null,{"$f":"IF(ISERROR((SUM('B6-FinPos'!L10:L12)-SUM('B6-FinPos'!K10:K12))/SUM('B6-FinPos'!K10:K12)), 0, (SUM('B6-FinPos'!L10:L12)-SUM('B6-FinPos'!K10:K12))/SUM('B6-FinPos'!K10:K12))","v":4.9690295705302409E-2},{"$f":"IF(ISERROR((SUM('B6-FinPos'!M10:M12)-SUM('B6-FinPos'!L10:L12))/SUM('B6-FinPos'!L10:L12)), 0, (SUM('B6-FinPos'!M10:M12)-SUM('B6-FinPos'!L10:L12))/SUM('B6-FinPos'!L10:L12))","v":4.92014264741844E-2}]
["Long term receivables % change - incr(decr)",12,"18(1)a",0,0,0,null,null,null,{"$f":"IF(ISERROR(('B6-FinPos'!L17-'B6-FinPos'!K17)/'B6-FinPos'!K17),0,(('B6-FinPos'!L17-'B6-FinPos'!K17)/'B6-FinPos'!K17))","v":0},{"$f":"IF(ISERROR(('B6-FinPos'!M17-'B6-FinPos'!L17)/'B6-FinPos'!L17),0,(('B6-FinPos'!M17-'B6-FinPos'!L17)/'B6-FinPos'!L17))","v":0}]
["R&M % of Property Plant & Equipment",13,"20(1)(vi)",9.3963152385300088E-3,6.0513809082796584E-3,2.7E-2,{"$f":"IF(ISERROR('B9-Asset'!C171/'B9-Asset'!C167),0,('B9-Asset'!C171/'B9-Asset'!C167))","v":2.5865338558146277E-2},{"$f":"IF(ISERROR('B9-Asset'!D171/'B9-Asset'!D167),0,('B9-Asset'!D171/'B9-Asset'!D167))","v":0},{"$f":"IF(ISERROR('B9-Asset'!K171/'B9-Asset'!K167),0,('B9-Asset'!K171/'B9-Asset'!K167))","v":2.682428125267616E-2},{"$f":"IF(ISERROR('B9-Asset'!L171/'B9-Asset'!L167),0,('B9-Asset'!L171/'B9-Asset'!L167))","v":1.1584007345975712E-2},{"$f":"IF(ISERROR('B9-Asset'!M171/'B9-Asset'!M167),0,('B9-Asset'!M171/'B9-Asset'!M167))","v":1.2214646730147057E-2}]
["Asset renewal % of capital budget",14,{"$f":"C17","v":"20(1)(vi)"},0.17,0.14000000000000001,0.156,{"$f":"IF(ISERROR('B9-Asset'!C39/'B9-Asset'!C134),0,('B9-Asset'!C39/'B9-Asset'!C134))","v":0.15107132225952266},{"$f":"IF(ISERROR('B9-Asset'!D39/'B9-Asset'!D134),0,('B9-Asset'!D39/'B9-Asset'!D134))","v":0},{"$f":"IF(ISERROR('B9-Asset'!K39/'B9-Asset'!K134),0,('B9-Asset'!K39/'B9-Asset'!K134))","v":0.15595646210365061},{"$f":"IF(ISERROR('B9-Asset'!L39/'B9-Asset'!L134),0,('B9-Asset'!L39/'B9-Asset'!L134))","v":0},{"$f":"IF(ISERROR('B9-Asset'!M39/'B9-Asset'!M134),0,('B9-Asset'!M39/'B9-Asset'!M134))","v":0}]
[{"$f":"head27a","v":"References"}]
["1. Positive cash balances indicative of minimum compliance - subject to 2"]
["2. Deduct applications (defined) from cash balances"]
["3. Indicative of sufficient liquidity to meet average monthly operating payments"]
["4. Indicative of funded operational requirements"]
["5. Indicative of adherence to macro-economic targets (prior to 2003/04 revenue not available for high capacity municipalities and later for other capacity classifications)"]
["6. Realistic average cash collection forecasts as % of annual billed revenue"]
["7. Realistic average increase in doubtful debt provision"]
["8. Indicative of planned capital expenditure level & cash payment timing"]
["9. Indicative of compliance with borrowing 'only' for the capital budget - should not exceed 100% unless refinancing"]
["10. Substantiation of National/Province allocations included in budget"]
["11. Indicative of realistic current arrear debtor collection targets (prior to 2003/04 revenue not available for high cap municipalities and later for other capacity classifications)"]
["12. Indicative of realistic long term arrear debtor collection targets (prior to 2003/04 revenue not available for high cap municipalities and later for other capacity classifications)"]
["13. Indicative of a credible allowance for repairs & maintenance of assets"]
["14. Indicative of a credible allowance for asset renewal (requires analysis of asset renewal projects as % of total capital projects - detailed capital plan)"]
[]
["Macro CPIX target",null,null,null,null,null,0.06,0.06,0.06,0.06,0.06]
["Total service charge revenue",null,null,null,null,null,{"$f":"IF(ISERROR(SUM('B4-FinPerf RE'!C7:C12)),0,(SUM('B4-FinPerf RE'!C7:C12)))","v":31157367.600000001},{"$f":"IF(ISERROR(SUM('B4-FinPerf RE'!D7:D12)),0,(SUM('B4-FinPerf RE'!D7:D12)))","v":0},{"$f":"IF(ISERROR(SUM('B4-FinPerf RE'!K7:K12)),0,(SUM('B4-FinPerf RE'!K7:K12)))","v":49573326.600000001},{"$f":"IF(ISERROR(SUM('B4-FinPerf RE'!L7:L12)),0,(SUM('B4-FinPerf RE'!L7:L12)))","v":48535594},{"$f":"IF(ISERROR(SUM('B4-FinPerf RE'!M7:M12)),0,(SUM('B4-FinPerf RE'!M7:M12)))","v":51690408}]
["Total service charge revenue - previous year",null,null,null,null,null,null,null,{"$f":"G37","v":0},{"$f":"I36","v":49573326.600000001},{"$f":"J36","v":48535594}]
["Provincial government gazetted allocations"]
["National government DoRA allocations"]
["Cash receipts from ratepayers",null,null,null,null,null,{"$f":"'B7-CFlow'!C8+'B7-CFlow'!C9+'B7-CFlow'!C10","v":48894588.854000002},{"$f":"'B7-CFlow'!D8+'B7-CFlow'!D9+'B7-CFlow'!D10","v":0},{"$f":"'B7-CFlow'!K8+'B7-CFlow'!K9+'B7-CFlow'!K10","v":91779588.854000002},{"$f":"'B7-CFlow'!L8+'B7-CFlow'!L9+'B7-CFlow'!L10","v":67722640.599999994},{"$f":"'B7-CFlow'!M8+'B7-CFlow'!M9+'B7-CFlow'!M10","v":72123522.200000003}]
["Ratepayer & Other revenue",null,null,null,null,null,{"$f":"SUM('B4-FinPerf RE'!C7:C13)+'B4-FinPerf RE'!C15+SUM('B4-FinPerf RE'!C17:C19)+'B4-FinPerf RE'!C21","v":86802164.789999992},{"$f":"SUM('B4-FinPerf RE'!D7:D13)+'B4-FinPerf RE'!D15+SUM('B4-FinPerf RE'!D17:D19)+'B4-FinPerf RE'!D21","v":0},{"$f":"SUM('B4-FinPerf RE'!K7:K13)+'B4-FinPerf RE'!K15+SUM('B4-FinPerf RE'!K17:K19)+'B4-FinPerf RE'!K21","v":133227364.78999999},{"$f":"SUM('B4-FinPerf RE'!L7:L13)+'B4-FinPerf RE'!L15+SUM('B4-FinPerf RE'!L17:L19)+'B4-FinPerf RE'!L21","v":108456793},{"$f":"SUM('B4-FinPerf RE'!M7:M13)+'B4-FinPerf RE'!M15+SUM('B4-FinPerf RE'!M17:M19)+'B4-FinPerf RE'!M21","v":115506484}]
["Change in debtors",null,null,null,null,null,null,null,null,{"$f":"(SUM('B6-FinPos'!L10:L12)+'B6-FinPos'!L17)-(SUM('B6-FinPos'!K10:K12)+'B6-FinPos'!K17)","v":3143040.3765592501},{"$f":"(SUM('B6-FinPos'!M10:M12)+'B6-FinPos'!M17)-(SUM('B6-FinPos'!L10:L12)+'B6-FinPos'!L17)","v":3266760.1968359202}]
[]
[]
[]
[]
[]
[]
[]
[]
[]
[]
[]
[]
[]
[]
[]
[]
[]
[]
[]
[]
[]
[]
[]
[]
[]
[]
[]
[]
["Average annual collection rate (arrears inclusive)"]

{"sheet":"SB7","index":25,"n_rows":62,"n_cols":13,"rows_kept":62,"cut":false,"hidden":false,"merged":[[59,0,59,10],[56,0,56,10],[1,0,3,0],[1,1,3,1],[1,2,1,8]]}
[{"$f":"muni&\" - \"&ADJB7&\" - \"&Date","v":"LIM332 Greater Letaba - Supporting Table SB7 Adjustments Budget - transfers and grant receipts - 27 February 2019"}]
[{"$f":"desc","v":"Description"},{"$f":"head27","v":"Ref"},{"$f":"Head2","v":"Budget Year 2018/19"},null,null,null,null,null,null,{"$f":"Head10","v":"Budget Year +1 2019/20"},{"$f":"Head11","v":"Budget Year +2 2020/21"}]
[null,null,{"$f":"Head6","v":"Original Budget"},{"$f":"Head54","v":"Prior Adjusted"},{"$f":"Head52","v":"Multi-year capital"},{"$f":"Head55","v":"Nat. or Prov. Govt"},{"$f":"Head50","v":"Other Adjusts."},{"$f":"Head56","v":"Total Adjusts."},{"$f":"Head7","v":"Adjusted Budget"},{"$f":"Head7","v":"Adjusted Budget"},{"$f":"Head7","v":"Adjusted Budget"}]
[null,null,null,7,8,9,10,11,12]
["R thousands",null,"A","A1","B","C","D","E","F"]
["RECEIPTS:","1, 2"]
[]
["Operating Transfers and Grants"]
["National Government:",null,{"$f":"SUM(C10:C16)","v":251181000},0,0,0,0,0,251181000,277224000,299604092]
["Local Government Equitable Share",null,244692000,null,null,null,0,{"$f":"SUM(E10:G10)","v":0},{"$f":"IF(D10=0,C10+H10,D10+H10)","v":244692000},271964000,295117000]
["Finance Management ",3,2145000,null,null,null,0,0,2145000,2145000,2145000]
["EPWP Incentive",null,1521000,null,null,null,0,0,1521000,0,0]
["Municipal Systems Improvement",null,0,null,null,null,null,0,0,0,0]
[null,null,null,null,null,null,null,0,0,0,0]
[null,null,null,null,null,null,null,0,0,0,0]
["MIG Operation",null,2823000,null,null,null,0,0,2823000,3115000,2342092]
["Provincial Government:",null,{"$f":"SUM(C18:C22)","v":0},0,0,0,0,0,0,0,0]
[null,null,null,null,null,null,null,{"$f":"SUM(E18:G18)","v":0},{"$f":"IF(D18=0,C18+H18,D18+H18)","v":0}]
[null,null,null,null,null,null,null,{"$f":"SUM(E19:G19)","v":0},{"$f":"IF(D19=0,C19+H19,D19+H19)","v":0}]
[null,4,null,null,null,null,null,{"$f":"SUM(E20:G20)","v":0},{"$f":"IF(D20=0,C20+H20,D20+H20)","v":0}]
[null,null,null,null,null,null,null,{"$f":"SUM(E21:G21)","v":0},{"$f":"IF(D21=0,C21+H21,D21+H21)","v":0}]
["Other transfers and grants [insert description]",5,null,null,null,null,null,{"$f":"SUM(E22:G22)","v":0},{"$f":"IF(D22=0,C22+H22,D22+H22)","v":0}]
["District Municipality:",null,{"$f":"SUM(C24:C25)","v":0},0,0,0,0,0,0,0,0]
["[insert description]",null,null,null,null,null,null,{"$f":"SUM(E24:G24)","v":0},{"$f":"IF(D24=0,C24+H24,D24+H24)","v":0}]
[null,null,null,null,null,null,null,{"$f":"SUM(E25:G25)","v":0},{"$f":"IF(D25=0,C25+H25,D25+H25)","v":0}]
["Other grant providers:",null,{"$f":"SUM(C27:C28)","v":0},0,0,0,0,0,0,0,0]
["[insert description]",null,null,null,null,null,null,{"$f":"SUM(E27:G27)","v":0},{"$f":"IF(D27=0,C27+H27,D27+H27)","v":0}]
[null,null,null,null,null,null,null,{"$f":"SUM(E28:G28)","v":0},{"$f":"IF(D28=0,C28+H28,D28+H28)","v":0}]
["Total Operating Transfers and Grants",6,{"$f":"C9+C17+C23+C26","v":251181000},0,0,0,0,0,{"$f":"I9+I17+I23+I26","v":251181000},277224000,299604092]
[]
["Capital Transfers and Grants"]
[{"$f":"A9","v":"National Government:"},null,{"$f":"SUM(C33:C38)","v":59620000},0,0,0,0,0,59620000,65128000,70940908]
[" Municipal Infrastructure Grant (MIG)",null,{"$f":"56460000-2823000","v":53637000},null,null,null,0,{"$f":"SUM(E33:G33)","v":0},{"$f":"IF(D33=0,C33+H33,D33+H33)","v":53637000},54493000,58440908]
["Intergrated National Electrification Programme",null,5983000,null,null,null,0,0,5983000,10635000,12500000]
[null,null,null,null,null,null,null,0,0]
[null,null,null,null,null,null,null,0,0,null,null,null,"`"]
[null,null,null,null,null,null,null,0,0]
["Other capital transfers [insert description]",null,null,null,null,null,null,0,0]
[{"$f":"A17","v":"Provincial Government:"},null,{"$f":"SUM(C40:C41)","v":0},0,0,0,0,0,0,0,0]
["Other capital transfers/grants [insert description]",null,null,null,null,null,null,{"$f":"SUM(E40:G40)","v":0},{"$f":"IF(D40=0,C40+H40,D40+H40)","v":0}]
[null,null,null,null,null,null,null,{"$f":"SUM(E41:G41)","v":0},{"$f":"IF(D41=0,C41+H41,D41+H41)","v":0}]
[{"$f":"A23","v":"District Municipality:"},null,{"$f":"SUM(C43:C44)","v":0},0,0,0,0,0,0,0,0]
["[insert description]",null,null,null,null,null,null,{"$f":"SUM(E43:G43)","v":0},{"$f":"IF(D43=0,C43+H43,D43+H43)","v":0}]
[null,null,null,null,null,null,null,{"$f":"SUM(E44:G44)","v":0},{"$f":"IF(D44=0,C44+H44,D44+H44)","v":0}]
[{"$f":"A26","v":"Other grant providers:"},null,{"$f":"SUM(C46:C47)","v":0},0,0,0,0,0,0,0,0]
["[insert description]",null,null,null,null,null,null,{"$f":"SUM(E46:G46)","v":0},{"$f":"IF(D46=0,C46+H46,D46+H46)","v":0}]
[null,null,null,null,null,null,null,{"$f":"SUM(E47:G47)","v":0},{"$f":"IF(D47=0,C47+H47,D47+H47)","v":0}]
["Total Capital Transfers and Grants",6,{"$f":"C32+C39+C42+C45","v":59620000},0,0,0,0,0,{"$f":"I32+I39+I42+I45","v":59620000},65128000,70940908]
["TOTAL RECEIPTS OF TRANSFERS & GRANTS",null,{"$f":"C29+C48","v":310801000},0,0,0,0,0,{"$f":"I29+I48","v":310801000},342352000,370545000]
[{"$f":"head27a","v":"References"}]
["1. Each grant is listed by name as gazetted together with the name of the transferring department or municipality, donor or other organisation"]
["2. Amounts actually RECEIVED; not revenue earned (the objective is to confirm grants allocated)"]
["3. Replacement of RSC levies"]
["4. Housing subsidies for housing where ownership transferred to organisations or persons outside the control of the municipality"]
["5. Motor vehicle licensing refunds to be included under 'agency' services (Not shown here as Receipts)"]
["6. Total Grant Receipts original budget must reconcile to budget supporting table A18"]
["7. Only complete if a previous adjusted budget has been approved in the same financial year. Reflect most recent adjusted budget."]
["8. Increases of funds approved under section 31 MFMA"]
["9. Adjustments to funding allocations from National or Provincial Government"]
["10. Adjusts. = 'Other' Adjustments proposed to be approved; including revenue under-collection (MFMA section 28(2)(a)); error correction (section 28(2)(f)); functional shifts and any adjustments made under delegation by the AO since the budget was approve"]
["11. E = B + C + D"]
["12. Adjusted Budget F = (A or A1/2 etc) + E"]

{"sheet":"SB8","index":26,"n_rows":58,"n_cols":11,"rows_kept":58,"cut":false,"hidden":false,"merged":[[55,0,55,10],[1,0,3,0],[1,1,3,1],[1,2,1,8]]}
[{"$f":"muni&\" - \"&ADJB8&\" - \"&Date","v":"LIM332 Greater Letaba - Supporting Table SB8 Adjustments Budget - expenditure on transfers and grant programme - 27 February 2019"}]
[{"$f":"desc","v":"Description"},{"$f":"head27","v":"Ref"},{"$f":"Head2","v":"Budget Year 2018/19"},null,null,null,null,null,null,{"$f":"Head10","v":"Budget Year +1 2019/20"},{"$f":"Head11","v":"Budget Year +2 2020/21"}]
[null,null,{"$f":"Head6","v":"Original Budget"},{"$f":"Head54","v":"Prior Adjusted"},{"$f":"Head52","v":"Multi-year capital"},{"$f":"Head55","v":"Nat. or Prov. Govt"},{"$f":"Head50","v":"Other Adjusts."},{"$f":"Head56","v":"Total Adjusts."},{"$f":"Head7","v":"Adjusted Budget"},{"$f":"Head7","v":"Adjusted Budget"},{"$f":"Head7","v":"Adjusted Budget"}]
[null,null,null,2,3,4,5,6,7]
["R thousands",null,"A","A1","B","C","D","E","F"]
["EXPENDITURE ON TRANSFERS AND GRANT PROGRAM:",1]
[]
["Operating expenditure of Transfers and Grants"]
["National Government:",null,{"$f":"SUM(C10:C16)","v":251181000},0,0,0,0,0,251181000,277224000,299604092]
[{"$f":"'SB7'!A10","v":"Local Government Equitable Share"},null,244692000,null,null,null,null,{"$f":"SUM(E10:G10)","v":0},{"$f":"IF(D10=0,C10+H10,D10+H10)","v":244692000},271964000,295117000]
[{"$f":"'SB7'!A11","v":"Finance Management "},null,2145000,null,null,null,null,0,2145000,2145000,2145000]
[{"$f":"'SB7'!A12","v":"EPWP Incentive"},null,1521000,null,null,null,null,0,1521000,0,0]
[{"$f":"'SB7'!A13","v":"Municipal Systems Improvement"},null,null,null,null,null,null,0,0]
[{"$f":"'SB7'!A14","v":0},null,null,null,null,null,null,0,0]
[{"$f":"'SB7'!A15","v":0},null,null,null,null,null,null,0,0]
[{"$f":"'SB7'!A16","v":"MIG Operation"},null,2823000,null,null,null,null,0,2823000,3115000,2342092]
["Provincial Government:",null,{"$f":"SUM(C18:C22)","v":0},0,0,0,0,0,0,0,0]
[{"$f":"'SB7'!A18","v":0},null,null,null,null,null,null,{"$f":"SUM(E18:G18)","v":0},{"$f":"IF(D18=0,C18+H18,D18+H18)","v":0}]
[{"$f":"'SB7'!A19","v":0},null,null,null,null,null,null,{"$f":"SUM(E19:G19)","v":0},{"$f":"IF(D19=0,C19+H19,D19+H19)","v":0}]
[{"$f":"'SB7'!A20","v":0},null,null,null,null,null,null,{"$f":"SUM(E20:G20)","v":0},{"$f":"IF(D20=0,C20+H20,D20+H20)","v":0}]
[{"$f":"'SB7'!A21","v":0},null,null,null,null,null,null,{"$f":"SUM(E21:G21)","v":0},{"$f":"IF(D21=0,C21+H21,D21+H21)","v":0}]
[{"$f":"'SB7'!A22","v":"Other transfers and grants [insert description]"},null,null,null,null,null,null,{"$f":"SUM(E22:G22)","v":0},{"$f":"IF(D22=0,C22+H22,D22+H22)","v":0}]
["District Municipality:",null,{"$f":"SUM(C24:C25)","v":0},0,0,0,0,0,0,0,0]
[{"$f":"'SB7'!A24","v":"[insert description]"},null,null,null,null,null,null,{"$f":"SUM(E24:G24)","v":0},{"$f":"IF(D24=0,C24+H24,D24+H24)","v":0}]
[{"$f":"'SB7'!A25","v":0},null,null,null,null,null,null,{"$f":"SUM(E25:G25)","v":0},{"$f":"IF(D25=0,C25+H25,D25+H25)","v":0}]
["Other grant providers:",null,{"$f":"SUM(C27:C28)","v":0},0,0,0,0,0,0,0,0]
[{"$f":"'SB7'!A27","v":"[insert description]"},null,null,null,null,null,null,{"$f":"SUM(E27:G27)","v":0},{"$f":"IF(D27=0,C27+H27,D27+H27)","v":0}]
[{"$f":"'SB7'!A28","v":0},null,null,null,null,null,null,{"$f":"SUM(E28:G28)","v":0},{"$f":"IF(D28=0,C28+H28,D28+H28)","v":0}]
["Total operating expenditure of Transfers and Grants:",null,{"$f":"C9+C17+C23+C26","v":251181000},0,0,0,0,0,{"$f":"I9+I17+I23+I26","v":251181000},277224000,299604092]
[]
["Capital expenditure of Transfers and Grants"]
["National Government:",null,{"$f":"SUM(C33:C38)","v":59620000},0,0,0,0,0,59620000,65128000,70940908]
[{"$f":"'SB7'!A33","v":" Municipal Infrastructure Grant (MIG)"},null,{"$f":"56460000-2823000","v":53637000},null,null,null,null,{"$f":"SUM(E33:G33)","v":0},{"$f":"IF(D33=0,C33+H33,D33+H33)","v":53637000},54493000,58440908]
[{"$f":"'SB7'!A34","v":"Intergrated National Electrification Programme"},null,5983000,null,null,null,null,0,5983000,10635000,12500000]
[{"$f":"'SB7'!A35","v":0},null,null,null,null,null,null,0,0]
[{"$f":"'SB7'!A36","v":0},null,null,null,null,null,null,0,0]
[{"$f":"'SB7'!A37","v":0},null,null,null,null,null,null,0,0]
[{"$f":"'SB7'!A38","v":"Other capital transfers [insert description]"},null,null,null,null,null,null,0,0]
["Provincial Government:",null,{"$f":"SUM(C40:C41)","v":0},0,0,0,0,0,0,0,0]
[{"$f":"'SB7'!A40","v":"Other capital transfers/grants [insert description]"},null,null,null,null,null,null,{"$f":"SUM(E40:G40)","v":0},{"$f":"IF(D40=0,C40+H40,D40+H40)","v":0}]
[{"$f":"'SB7'!A41","v":0},null,null,null,null,null,null,{"$f":"SUM(E41:G41)","v":0},{"$f":"IF(D41=0,C41+H41,D41+H41)","v":0}]
["District Municipality:",null,{"$f":"SUM(C43:C44)","v":0},0,0,0,0,0,0,0,0]
[{"$f":"'SB7'!A43","v":"[insert description]"},null,null,null,null,null,null,{"$f":"SUM(E43:G43)","v":0},{"$f":"IF(D43=0,C43+H43,D43+H43)","v":0}]
[{"$f":"'SB7'!A44","v":0},null,null,null,null,null,null,{"$f":"SUM(E44:G44)","v":0},{"$f":"IF(D44=0,C44+H44,D44+H44)","v":0}]
["Other grant providers:",null,{"$f":"SUM(C46:C47)","v":0},0,0,0,0,0,0,0,0]
[{"$f":"'SB7'!A46","v":"[insert description]"},null,null,null,null,null,null,{"$f":"SUM(E46:G46)","v":0},{"$f":"IF(D46=0,C46+H46,D46+H46)","v":0}]
[{"$f":"'SB7'!A47","v":0},null,null,null,null,null,null,{"$f":"SUM(E47:G47)","v":0},{"$f":"IF(D47=0,C47+H47,D47+H47)","v":0}]
["Total capital expenditure of Transfers and Grants",null,{"$f":"C32+C39+C42+C45","v":59620000},0,0,0,0,0,59620000,65128000,70940908]
[]
["Total capital expenditure of Transfers and Grants",null,{"$f":"C29+C48","v":310801000},0,0,0,0,0,310801000,342352000,370545000]
[{"$f":"head27a","v":"References"}]
["1. Transfers/Grant expenditure must be separately listed for each allocation received"]
["2. Only complete if a previous adjusted budget has been approved in the same financial year. Reflect most recent adjusted budget."]
["3. Increases of funds approved under section 31 MFMA"]
["4. Adjustments to funding allocations from National or Provincial Government"]
["5. Adjusts. = 'Other' Adjustments proposed to be approved; error correction (section 28(2)(f)); functional shifts and any adjustments made under delegation by the AO since the budget was approved or since a previously 'approved' Adjustments Budget in the "]
["6. E = B + C + D"]
["7. Adjusted Budget F = (A or A1/2 etc) + E"]

{"sheet":"SB9","index":27,"n_rows":65,"n_cols":11,"rows_kept":65,"cut":false,"hidden":false,"merged":[[59,0,59,10],[62,0,62,10],[1,2,1,8],[1,0,3,0],[1,1,3,1]]}
[{"$f":"muni&\" - \"&ADJB9&\" - \"&Date","v":"LIM332 Greater Letaba - Supporting Table SB9 Adjustments Budget - reconciliation of transfers, grant receipts, and unspent funds - 27 February 2019"}]
[{"$f":"desc","v":"Description"},{"$f":"head27","v":"Ref"},{"$f":"Head2","v":"Budget Year 2018/19"},null,null,null,null,null,null,{"$f":"Head10","v":"Budget Year +1 2019/20"},{"$f":"Head11","v":"Budget Year +2 2020/21"}]
[null,null,{"$f":"Head6","v":"Original Budget"},{"$f":"Head54","v":"Prior Adjusted"},{"$f":"Head52","v":"Multi-year capital"},{"$f":"Head55","v":"Nat. or Prov. Govt"},{"$f":"Head50","v":"Other Adjusts."},{"$f":"Head56","v":"Total Adjusts."},{"$f":"Head7","v":"Adjusted Budget"},{"$f":"Head7","v":"Adjusted Budget"},{"$f":"Head7","v":"Adjusted Budget"}]
[null,null,null,2,3,4,5,6,7]
["R thousands",null,"A","A1","B","C","D","E","F"]
["Operating transfers and grants:"]
["National Government:"]
["Balance unspent at beginning of the year",null,null,null,null,null,null,{"$f":"SUM(E8:G8)","v":0},{"$f":"IF(D8=0,C8+H8,D8+H8)","v":0}]
["Current year receipts",null,251181000,null,null,null,null,{"$f":"SUM(E9:G9)","v":0},{"$f":"IF(D9=0,C9+H9,D9+H9)","v":251181000},277224000,299604091.52999997]
["Conditions met - transferred to revenue",null,{"$f":"C8+C9-C11","v":251181000},0,0,0,0,0,251181000,277224000,299604091.52999997]
["Conditions still to be met - transferred to liabilities",null,null,null,null,null,null,{"$f":"SUM(E11:G11)","v":0},{"$f":"IF(D11=0,C11+H11,D11+H11)","v":0}]
["Provincial Government:"]
["Balance unspent at beginning of the year",null,null,null,null,null,null,{"$f":"SUM(E13:G13)","v":0},{"$f":"IF(D13=0,C13+H13,D13+H13)","v":0}]
[{"$f":"A9","v":"Current year receipts"},null,null,null,null,null,null,{"$f":"SUM(E14:G14)","v":0},{"$f":"IF(D14=0,C14+H14,D14+H14)","v":0}]
[{"$f":"A10","v":"Conditions met - transferred to revenue"},null,{"$f":"C13+C14-C16","v":0},0,0,0,0,0,0,0,0]
[{"$f":"A11","v":"Conditions still to be met - transferred to liabilities"},null,null,null,null,null,null,{"$f":"SUM(E16:G16)","v":0},{"$f":"IF(D16=0,C16+H16,D16+H16)","v":0}]
["District Municipality:"]
[{"$f":"A13","v":"Balance unspent at beginning of the year"},null,null,null,null,null,null,{"$f":"SUM(E18:G18)","v":0},{"$f":"IF(D18=0,C18+H18,D18+H18)","v":0}]
[{"$f":"A14","v":"Current year receipts"},null,null,null,null,null,null,{"$f":"SUM(E19:G19)","v":0},{"$f":"IF(D19=0,C19+H19,D19+H19)","v":0}]
[{"$f":"A15","v":"Conditions met - transferred to revenue"},null,{"$f":"C18+C19-C21","v":0},0,0,0,0,0,0,0,0]
[{"$f":"A16","v":"Conditions still to be met - transferred to liabilities"},null,null,null,null,null,null,{"$f":"SUM(E21:G21)","v":0},{"$f":"IF(D21=0,C21+H21,D21+H21)","v":0}]
["Other grant providers:"]
[{"$f":"A13","v":"Balance unspent at beginning of the year"},null,null,null,null,null,null,{"$f":"SUM(E23:G23)","v":0},{"$f":"IF(D23=0,C23+H23,D23+H23)","v":0}]
[{"$f":"A14","v":"Current year receipts"},null,null,null,null,null,null,{"$f":"SUM(E24:G24)","v":0},{"$f":"IF(D24=0,C24+H24,D24+H24)","v":0}]
[{"$f":"A15","v":"Conditions met - transferred to revenue"},null,{"$f":"C23+C24-C26","v":0},0,0,0,0,0,0,0,0]
[{"$f":"A16","v":"Conditions still to be met - transferred to liabilities"},null,null,null,null,null,null,{"$f":"SUM(E26:G26)","v":0},{"$f":"IF(D26=0,C26+H26,D26+H26)","v":0}]
["Total operating transfers and grants revenue",null,{"$f":"C10+C15+C20+C25","v":251181000},0,0,0,0,0,251181000,277224000,299604091.52999997]
["Total operating transfers and grants - CTBM",2,{"$f":"C11+C16+C21+C26","v":0},0,0,0,0,0,0,0,0]
[]
["Capital transfers and grants:"]
[{"$f":"A7","v":"National Government:"}]
["Balance unspent at beginning of the year",null,0,null,null,null,null,{"$f":"SUM(E32:G32)","v":0},{"$f":"IF(D32=0,C32+H32,D32+H32)","v":0}]
["Current year receipts",null,{"$f":"62443000-2823000","v":59620000},null,null,null,null,{"$f":"SUM(E33:G33)","v":0},{"$f":"IF(D33=0,C33+H33,D33+H33)","v":59620000},{"$f":"68243000-3115000","v":65128000},{"$f":"73283000-2342091.53","v":70940908.469999999}]
["Conditions met - transferred to revenue",null,{"$f":"C32+C33-C35","v":59620000},0,0,0,0,0,59620000,65128000,70940908.469999999]
["Conditions still to be met - transferred to liabilities",null,null,null,null,null,null,{"$f":"SUM(E35:G35)","v":0},{"$f":"IF(D35=0,C35+H35,D35+H35)","v":0}]
["Provincial Government:"]
["Balance unspent at beginning of the year",null,null,null,null,null,null,{"$f":"SUM(E37:G37)","v":0},{"$f":"IF(D37=0,C37+H37,D37+H37)","v":0}]
[{"$f":"A33","v":"Current year receipts"},null,null,null,null,null,null,{"$f":"SUM(E38:G38)","v":0},{"$f":"IF(D38=0,C38+H38,D38+H38)","v":0}]
[{"$f":"A34","v":"Conditions met - transferred to revenue"},null,{"$f":"C37+C38-C40","v":0},0,0,0,0,0,0,0,0]
[{"$f":"A35","v":"Conditions still to be met - transferred to liabilities"},null,null,null,null,null,null,{"$f":"SUM(E40:G40)","v":0},{"$f":"IF(D40=0,C40+H40,D40+H40)","v":0}]
["District Municipality:"]
[{"$f":"A37","v":"Balance unspent at beginning of the year"},null,null,null,null,null,null,{"$f":"SUM(E42:G42)","v":0},{"$f":"IF(D42=0,C42+H42,D42+H42)","v":0}]
[{"$f":"A38","v":"Current year receipts"},null,null,null,null,null,null,{"$f":"SUM(E43:G43)","v":0},{"$f":"IF(D43=0,C43+H43,D43+H43)","v":0}]
[{"$f":"A39","v":"Conditions met - transferred to revenue"},null,{"$f":"C42+C43-C45","v":0},0,0,0,0,0,0,0,0]
[{"$f":"A40","v":"Conditions still to be met - transferred to liabilities"},null,null,null,null,null,null,{"$f":"SUM(E45:G45)","v":0},{"$f":"IF(D45=0,C45+H45,D45+H45)","v":0}]
["Other grant providers:"]
[{"$f":"A37","v":"Balance unspent at beginning of the year"},null,null,null,null,null,null,{"$f":"SUM(E47:G47)","v":0},{"$f":"IF(D47=0,C47+H47,D47+H47)","v":0}]
[{"$f":"A38","v":"Current year receipts"},null,null,null,null,null,null,{"$f":"SUM(E48:G48)","v":0},{"$f":"IF(D48=0,C48+H48,D48+H48)","v":0}]
[{"$f":"A39","v":"Conditions met - transferred to revenue"},null,{"$f":"C47+C48-C50","v":0},0,0,0,0,0,0,0,0]
[{"$f":"A40","v":"Conditions still to be met - transferred to liabilities"},null,null,null,null,null,null,{"$f":"SUM(E50:G50)","v":0},{"$f":"IF(D50=0,C50+H50,D50+H50)","v":0}]
["Total capital transfers and grants revenue",null,{"$f":"C34+C39+C44+C49","v":59620000},0,0,0,0,0,59620000,65128000,70940908.469999999]
["Total capital transfers and grants - CTBM",null,{"$f":"C35+C40+C45+C50","v":0},0,0,0,0,0,0,0,0]
[]
["TOTAL TRANSFERS AND GRANTS REVENUE",null,{"$f":"C27+C51","v":310801000},0,0,0,0,0,310801000,342352000,370545000]
["TOTAL TRANSFERS AND GRANTS -  CTBM",null,{"$f":"C28+C52","v":0},0,0,0,0,0,0,0,0]
[]
[{"$f":"head27a","v":"References"}]
["1. Total capital grants revenue budget must reconcile to budget tables A4 and A5; total operating grants revenue must reconcile to budget table A4"]
["2. CTBM = conditions to be met"]
["3. Only complete if a previous adjusted budget has been approved in the same financial year. Reflect most recent adjusted budget."]
["4. Increases of funds approved under section 31 MFMA"]
["5. Adjustments to funding allocations from National or Provincial Government"]
["5. Adjusts. = 'Other' Adjustments proposed to be approved; including revenue under-collection (MFMA section 28(2)(a)); additional revenue appropriation on existing programmes (section 28(2))(b); projected savings (section 28(2)(d)); error correction (sect"]
["6. E = B + C + D"]
["7. Adjusted Budget F = (A or A1/2 etc) + E"]

{"sheet":"SB10","index":28,"n_rows":71,"n_cols":13,"rows_kept":71,"cut":false,"hidden":false,"merged":[[1,0,3,0],[1,1,3,1],[1,2,1,10]]}
[{"$f":"muni&\" - \"&ADJB10&\" - \"&Date","v":"LIM332 Greater Letaba - Supporting Table SB10 Adjustments Budget - transfers and grants made by the municipality - 27 February 2019"}]
[{"$f":"desc","v":"Description"},{"$f":"head27","v":"Ref"},{"$f":"Head2","v":"Budget Year 2018/19"},null,null,null,null,null,null,null,null,{"$f":"Head10","v":"Budget Year +1 2019/20"},{"$f":"Head11","v":"Budget Year +2 2020/21"}]
[null,null,{"$f":"Head6","v":"Original Budget"},{"$f":"Head54","v":"Prior Adjusted"},{"$f":"Head51","v":"Accum. Funds"},{"$f":"Head52","v":"Multi-year capital"},{"$f":"Head53","v":"Unfore. Unavoid."},{"$f":"Head55","v":"Nat. or Prov. Govt"},{"$f":"Head50","v":"Other Adjusts."},{"$f":"Head56","v":"Total Adjusts."},{"$f":"Head7","v":"Adjusted Budget"},{"$f":"Head7","v":"Adjusted Budget"},{"$f":"Head7","v":"Adjusted Budget"}]
[null,null,null,6,7,8,9,10,11,12,13]
["R thousands",null,"A","A1","B","C","D","E","F","G","H"]
["Cash transfers to other municipalities"]
["[insert description]",1,null,null,null,null,null,null,null,{"$f":"SUM(E7:I7)","v":0},{"$f":"IF(D7=0,C7+J7,D7+J7)","v":0}]
["[insert description]",null,null,null,null,null,null,null,null,{"$f":"SUM(E8:I8)","v":0},{"$f":"IF(D8=0,C8+J8,D8+J8)","v":0}]
["[insert description]",null,null,null,null,null,null,null,null,{"$f":"SUM(E9:I9)","v":0},{"$f":"IF(D9=0,C9+J9,D9+J9)","v":0}]
["TOTAL ALLOCATIONS TO MUNICIPALITIES:",null,{"$f":"SUM(C7:C9)","v":0},0,0,0,0,0,0,0,0,0,0]
[]
["Cash transfers to Entities/Other External Mechanisms"]
["[insert description]",2,null,null,null,null,null,null,null,{"$f":"SUM(E13:I13)","v":0},{"$f":"IF(D13=0,C13+J13,D13+J13)","v":0}]
["[insert description]",null,null,null,null,null,null,null,null,{"$f":"SUM(E14:I14)","v":0},{"$f":"IF(D14=0,C14+J14,D14+J14)","v":0}]
["[insert description]",null,null,null,null,null,null,null,null,{"$f":"SUM(E15:I15)","v":0},{"$f":"IF(D15=0,C15+J15,D15+J15)","v":0}]
["TOTAL ALLOCATIONS TO ENTITIES/EMs'",null,{"$f":"SUM(C13:C15)","v":0},0,0,0,0,0,0,0,0,0,0]
[]
["Cash transfers to other Organs of State"]
["[insert description]",3,null,null,null,null,null,null,null,{"$f":"SUM(E19:I19)","v":0},{"$f":"IF(D19=0,C19+J19,D19+J19)","v":0}]
["[insert description]",null,null,null,null,null,null,null,null,{"$f":"SUM(E20:I20)","v":0},{"$f":"IF(D20=0,C20+J20,D20+J20)","v":0}]
["[insert description]",null,null,null,null,null,null,null,null,{"$f":"SUM(E21:I21)","v":0},{"$f":"IF(D21=0,C21+J21,D21+J21)","v":0}]
["TOTAL ALLOCATIONS TO OTHER ORGANS OF STATE:",null,{"$f":"SUM(C19:C21)","v":0},0,0,0,0,0,0,0,0,0,0]
[]
["Cash transfers to other Organisations"]
["[insert description]",4,null,null,null,null,null,null,null,{"$f":"SUM(E25:I25)","v":0},{"$f":"IF(D25=0,C25+J25,D25+J25)","v":0}]
["[insert description]",null,null,null,null,null,null,null,null,{"$f":"SUM(E26:I26)","v":0},{"$f":"IF(D26=0,C26+J26,D26+J26)","v":0}]
["[insert description]",null,null,null,null,null,null,null,null,{"$f":"SUM(E27:I27)","v":0},{"$f":"IF(D27=0,C27+J27,D27+J27)","v":0}]
["TOTAL CASH TRANSFERS TO OTHER ORGANISATIONS:",null,{"$f":"SUM(C25:C27)","v":0},0,0,0,0,0,0,0,0,0,0]
[]
["TOTAL CASH TRANSFERS",5,{"$f":"C10+C16+C22+C28","v":0},0,0,0,0,0,0,0,0,0,0]
[]
["Non-cash transfers to other municipalities"]
["[insert description]",1,null,null,null,null,null,null,null,{"$f":"SUM(E33:I33)","v":0},{"$f":"IF(D33=0,C33+J33,D33+J33)","v":0}]
["[insert description]",null,null,null,null,null,null,null,null,{"$f":"SUM(E34:I34)","v":0},{"$f":"IF(D34=0,C34+J34,D34+J34)","v":0}]
["[insert description]",null,null,null,null,null,null,null,null,{"$f":"SUM(E35:I35)","v":0},{"$f":"IF(D35=0,C35+J35,D35+J35)","v":0}]
["TOTAL ALLOCATIONS TO MUNICIPALITIES:",null,{"$f":"SUM(C33:C35)","v":0},0,0,0,0,0,0,0,0,0,0]
[]
["Non-cash transfers to Entities/Other External Mechanisms"]
["[insert description]",2,null,null,null,null,null,null,null,{"$f":"SUM(E39:I39)","v":0},{"$f":"IF(D39=0,C39+J39,D39+J39)","v":0}]
["[insert description]",null,null,null,null,null,null,null,null,{"$f":"SUM(E40:I40)","v":0},{"$f":"IF(D40=0,C40+J40,D40+J40)","v":0}]
["[insert description]",null,null,null,null,null,null,null,null,{"$f":"SUM(E41:I41)","v":0},{"$f":"IF(D41=0,C41+J41,D41+J41)","v":0}]
["TOTAL ALLOCATIONS TO ENTITIES/EMs'",null,{"$f":"SUM(C39:C41)","v":0},0,0,0,0,0,0,0,0,0,0]
[]
["Non-cash transfers to other Organs of State"]
["[insert description]",3,null,null,null,null,null,null,null,{"$f":"SUM(E45:I45)","v":0},{"$f":"IF(D45=0,C45+J45,D45+J45)","v":0}]
["[insert description]",null,null,null,null,null,null,null,null,{"$f":"SUM(E46:I46)","v":0},{"$f":"IF(D46=0,C46+J46,D46+J46)","v":0}]
["[insert description]",null,null,null,null,null,null,null,null,{"$f":"SUM(E47:I47)","v":0},{"$f":"IF(D47=0,C47+J47,D47+J47)","v":0}]
["TOTAL ALLOCATIONS TO OTHER ORGANS OF STATE:",null,{"$f":"SUM(C45:C47)","v":0},0,0,0,0,0,0,0,0,0,0]
[]
["Non-cash transfers to other Organisations"]
["[insert description]",4,null,null,null,null,null,null,null,{"$f":"SUM(E51:I51)","v":0},{"$f":"IF(D51=0,C51+J51,D51+J51)","v":0}]
["[insert description]",null,null,null,null,null,null,null,null,{"$f":"SUM(E52:I52)","v":0},{"$f":"IF(D52=0,C52+J52,D52+J52)","v":0}]
["[insert description]",null,null,null,null,null,null,null,null,{"$f":"SUM(E53:I53)","v":0},{"$f":"IF(D53=0,C53+J53,D53+J53)","v":0}]
["TOTAL NON-CASH TRANSFERS TO OTHER ORGANISATIONS:",null,{"$f":"SUM(C51:C53)","v":0},0,0,0,0,0,0,0,0,0,0]
[]
["TOTAL NON-CASH TRANSFERS",5,{"$f":"C35+C41+C47+C53","v":0},0,0,0,0,0,0,0,0,0,0]
["TOTAL TRANSFERS",null,{"$f":"C30+C56","v":0},{"$f":"D30+D56","v":0},0,0,0,0,0,0,0,0,0]
[{"$f":"head27a","v":"References"}]
["1. Insert description listed by municipal name and demarcation code of recipient"]
["2. Insert description of each entity or external mechanism (an external mechanism may be provided with resources to ensure a minimum level of service)"]
["3. Insert description of each Organ of State; e.g. Eskom"]
["4. Insert description of each 'other' organisation"]
["5. All descriptions should separate allocations for 'capital purposes' and 'operating purposes'"]
["6. Only complete if a previous adjusted budget has been approved in the same financial year. Reflect most recent adjusted budget."]
["7. Additional cash-backed accumulated funds/unspent funds (section 18(1)(b) and section 28(2)(e) MFMA) identified after Original Budget approved and after annual financial statements audited (note: only where underspending could not reasonably be have for"]
["8. Increases of funds approved under section 31 MFMA"]
["9. Adjustments approved in accordance with section 29 MFMA"]
["10. Adjustments to funding allocations from National or Provincial Government"]
["11. Adjusts. = 'Other' Adjustments proposed to be approved; including revenue under-collection (MFMA section 28(2)(a)); additional revenue appropriation on existing programmes (section 28(2))(b); projected savings (section 28(2)(d)); error correction (sec"]
["12. G = B + C + D + E +  F"]
["13. Adjusted Budget H = (A or A1/2 etc) + G"]

{"sheet":"SB11","index":29,"n_rows":120,"n_cols":12,"rows_kept":120,"cut":false,"hidden":false,"merged":[[1,0,2,0],[1,1,2,1],[117,0,117,11],[119,0,119,11],[112,0,112,11],[114,0,114,9],[115,0,115,11],[113,0,113,11],[1,2,1,10]]}
[{"$f":"muni&\" - \"&ADJB11&\" - \"&Date","v":"LIM332 Greater Letaba - Supporting Table SB11 Adjustments Budget - councillor and staff benefits - 27 February 2019"}]
["Summary of remuneration",{"$f":"head27","v":"Ref"},{"$f":"Head2","v":"Budget Year 2018/19"}]
[null,null,{"$f":"Head6","v":"Original Budget"},{"$f":"Head54","v":"Prior Adjusted"},{"$f":"Head51","v":"Accum. Funds"},{"$f":"Head52","v":"Multi-year capital"},{"$f":"Head53","v":"Unfore. Unavoid."},{"$f":"Head55","v":"Nat. or Prov. Govt"},{"$f":"Head50","v":"Other Adjusts."},{"$f":"Head56","v":"Total Adjusts."},{"$f":"Head7","v":"Adjusted Budget"},"% change"]
[null,null,null,5,6,7,8,9,10,11,12]
["R thousands",null,"A","A1","B","C","D","E","F","G","H"]
["Councillors (Political Office Bearers plus Other)"]
["Basic Salaries and Wages",null,22467854.930760719,null,null,null,null,null,414177,{"$f":"G7+I7","v":414177},{"$f":"IF(D7=0,C7+J7,D7+J7)","v":22882031.930760719},{"$f":"IF(K7=0,\"\",(K7/C7)-1)","v":1.8434203054825238E-2}]
["Pension and UIF Contributions",null,null,null,null,null,null,null,null,0,0,{"$f":"IF(K8=0,\"\",(K8/C8)-1)","v":""}]
["Medical Aid Contributions",null,null,null,null,null,null,null,null,0,0,{"$f":"IF(K9=0,\"\",(K9/C9)-1)","v":""}]
["Motor Vehicle Allowance",null,null,null,null,null,null,null,null,0,0,{"$f":"IF(K10=0,\"\",(K10/C10)-1)","v":""}]
["Cellphone Allowance",null,null,null,null,null,null,null,null,0,0]
["Housing Allowances",null,null,null,null,null,null,null,null,0,0]
["Other benefits and allowances",null,null,null,null,null,null,null,null,0,0]
["Sub Total - Councillors",null,{"$f":"SUM(C7:C13)","v":22467854.930760719},{"$f":"SUM(D7:D13)","v":0},null,null,{"$f":"SUM(G7:G13)","v":0},null,{"$f":"SUM(I7:I13)","v":414177},{"$f":"SUM(J7:J13)","v":414177},{"$f":"SUM(K7:K13)","v":22882031.930760719},{"$f":"IF(K14=0,\"\",(K14/C14)-1)","v":1.8434203054825238E-2}]
["% increase",null,null,{"$f":"IF(ISERROR((D14/C14)-1),0,((D14/C14)-1))","v":-1},null,null,null,null,null,null,{"$f":"IF(ISERROR((K14/J14)-1),0,((K14/J14)-1))","v":54.246988439147316}]
[]
["Senior Managers of the Municipality"]
["Basic Salaries and Wages",null,5812871,null,null,null,null,null,{"$f":"-23253.65+46000+48026.88+163661.33+286820.46","v":521255.02},{"$f":"E18+G18+I18","v":521255.02},{"$f":"IF(D18=0,C18+J18,D18+J18)","v":6334126.0199999996},{"$f":"IF(K18=0,\"\",(K18/C18)-1)","v":8.9672559394488482E-2}]
["Pension and UIF Contributions",null,null,null,null,null,null,null,null,0,0,""]
["Medical Aid Contributions",null,null,null,null,null,null,null,null,0,0,""]
["Overtime",null,null,null,null,null,null,null,null,{"$f":"E21+G21+I21","v":0},0,""]
["Performance Bonus",null,null,null,null,null,null,null,null,{"$f":"E22+G22+I22","v":0},{"$f":"IF(D22=0,C22+J22,D22+J22)","v":0}]
["Motor Vehicle Allowance",null,null,null,null,null,null,null,null,0,0,""]
["Cellphone Allowance",null,null,null,null,null,null,null,null,0,0,""]
["Housing Allowances",null,null,null,null,null,null,null,null,{"$f":"E25+G25+I25","v":0},{"$f":"IF(D25=0,C25+J25,D25+J25)","v":0}]
["Other benefits and allowances",null,null,null,null,null,null,null,null,{"$f":"E26+G26+I26","v":0},{"$f":"IF(D26=0,C26+J26,D26+J26)","v":0}]
["Payments in lieu of leave",null,null,null,null,null,null,null,null,{"$f":"E27+G27+I27","v":0},{"$f":"IF(D27=0,C27+J27,D27+J27)","v":0}]
["Long service awards",null,null,null,null,null,null,null,null,0,0,""]
["Post-retirement benefit obligations",5,null,null,null,null,null,null,null,0,0,""]
["Sub Total - Senior Managers of Municipality",null,{"$f":"SUM(C18:C29)","v":5812871},{"$f":"SUM(D18:D29)","v":0},{"$f":"SUM(E18:E29)","v":0},null,{"$f":"SUM(G18:G29)","v":0},null,{"$f":"SUM(I18:I29)","v":521255.02},{"$f":"SUM(J18:J29)","v":521255.02},{"$f":"SUM(K18:K29)","v":6334126.0199999996},8.9672559394488482E-2]
[{"$f":"$A$15","v":"% increase"},null,null,{"$f":"IF(ISERROR((D30/C30)-1),0,((D30/C30)-1))","v":-1},null,null,null,null,null,null,{"$f":"IF(ISERROR((K30/J30)-1),0,((K30/J30)-1))","v":11.151683488822801}]
[]
["Other Municipal Staff"]
["Basic Salaries and Wages",null,{"$f":"49033296-C18","v":43220425},null,null,null,null,null,{"$f":"14045852-I18","v":13524596.98},{"$f":"SUM(E34:I34)","v":13524596.98},{"$f":"IF(D34=0,C34+J34,D34+J34)","v":56745021.980000004},{"$f":"IF(K34=0,\"\",(K34/C34)-1)","v":0.31292142499755626}]
["Pension and UIF Contributions",null,9941819.1400000006,null,null,null,null,null,1022102,1022102,10963921.140000001,0.10280834780907111]
["Medical Aid Contributions",null,3788001.87,null,null,null,null,null,527788,527788,4315789.87,0.13933150460667543]
["Overtime",null,2767431.78,null,null,null,null,null,1135323,1135323,3902754.78,0.41024425902921458]
["Performance Bonus",null,4651085.8099999996,null,null,null,null,null,-880346,{"$f":"SUM(E38:I38)","v":-880346},{"$f":"IF(D38=0,C38+J38,D38+J38)","v":3770739.8099999996}]
["Motor Vehicle Allowance",null,4658216.47,null,null,null,null,null,515138,515138,5173354.47,0.11058696033505711]
["Cellphone Allowance",null,0,null,null,null,null,null,0,0,0,""]
["Housing Allowances",null,494732.71,null,null,null,null,null,222834,{"$f":"SUM(E41:I41)","v":222834},{"$f":"IF(D41=0,C41+J41,D41+J41)","v":717566.71}]
["Other benefits and allowances",null,876429.04999999993,null,null,null,null,null,{"$f":"174671+5275+67642+30975","v":278563},{"$f":"SUM(E42:I42)","v":278563},{"$f":"IF(D42=0,C42+J42,D42+J42)","v":1154992.0499999998}]
["Payments in lieu of leave",null,2092783.93,null,null,null,null,null,95248,95248,2188031.9299999997,4.5512581893726534E-2]
["Long service awards",null,0,null,null,null,null,null,0,0,0,""]
["Post-retirement benefit obligations",5,0,null,null,null,null,null,0,0,0,""]
["Sub Total - Other Municipal Staff",null,{"$f":"SUM(C34:C45)","v":72490925.760000005},0,0,0,0,0,16441246.98,16441246.98,88932172.74000001,0.22680420766639142]
[{"$f":"$A$15","v":"% increase"}]
["Total Parent Municipality",null,{"$f":"C14+C30+C46","v":100771651.69076073},0,0,0,0,0,17376679,17376679,118148330.69076073,{"$f":"IF(K48=0,\"\",(K48/C48)-1)","v":0.17243618327626553}]
[]
[]
["Board Members of Entities"]
["Basic Salaries and Wages",null,null,null,null,null,null,null,null,{"$f":"SUM(E52:I52)","v":0},{"$f":"IF(D52=0,C52+J52,D52+J52)","v":0},{"$f":"IF(K52=0,\"\",(K52/C52)-1)","v":""}]
["Pension and UIF Contributions",null,null,null,null,null,null,null,null,0,0,{"$f":"IF(K53=0,\"\",(K53/C53)-1)","v":""}]
["Medical Aid Contributions",null,null,null,null,null,null,null,null,0,0,{"$f":"IF(K54=0,\"\",(K54/C54)-1)","v":""}]
["Overtime",null,null,null,null,null,null,null,null,0,{"$f":"IF(D55=0,C55+J55,D55+J55)","v":0}]
["Performance Bonus",null,null,null,null,null,null,null,null,0,{"$f":"IF(D56=0,C56+J56,D56+J56)","v":0}]
["Motor Vehicle Allowance",null,null,null,null,null,null,null,null,0,{"$f":"IF(D57=0,C57+J57,D57+J57)","v":0}]
["Cellphone Allowance",null,null,null,null,null,null,null,null,0,{"$f":"IF(D58=0,C58+J58,D58+J58)","v":0}]
["Housing Allowances",null,null,null,null,null,null,null,null,{"$f":"G59+I59","v":0},0,{"$f":"IF(K59=0,\"\",(K59/C59)-1)","v":""}]
["Other benefits and allowances",null,null,null,null,null,null,null,null,{"$f":"G60+I60","v":0},0]
["Board Fees",null,null,null,null,null,null,null,null,{"$f":"SUM(E61:I61)","v":0},0,{"$f":"IF(K61=0,\"\",(K61/C61)-1)","v":""}]
["Payments in lieu of leave",null,null,null,null,null,null,null,null,{"$f":"SUM(E62:I62)","v":0},0,{"$f":"IF(K62=0,\"\",(K62/C62)-1)","v":""}]
["Long service awards",null,null,null,null,null,null,null,null,{"$f":"SUM(E63:I63)","v":0},{"$f":"IF(D63=0,C63+J63,D63+J63)","v":0}]
["Post-retirement benefit obligations",5,null,null,null,null,null,null,null,{"$f":"SUM(E64:I64)","v":0},0,{"$f":"IF(K64=0,\"\",(K64/C64)-1)","v":""}]
["Sub Total - Board Members of Entities",null,{"$f":"SUM(C52:C64)","v":0},0,0,0,0,0,0,0,0,{"$f":"IF(K65=0,\"\",(K65/C65)-1)","v":""}]
[{"$f":"$A$15","v":"% increase"}]
[]
["Senior Managers of Entities"]
["Basic Salaries and Wages",null,null,null,null,null,null,null,null,{"$f":"SUM(E69:I69)","v":0},{"$f":"IF(D69=0,C69+J69,D69+J69)","v":0},{"$f":"IF(K69=0,\"\",(K69/C69)-1)","v":""}]
["Pension and UIF Contributions",null,null,null,null,null,null,null,null,0,0,""]
["Medical Aid Contributions",null,null,null,null,null,null,null,null,0,0,""]
["Overtime",null,null,null,null,null,null,null,null,{"$f":"SUM(E72:I72)","v":0},{"$f":"IF(D72=0,C72+J72,D72+J72)","v":0}]
["Performance Bonus",null,null,null,null,null,null,null,null,{"$f":"SUM(E73:I73)","v":0},{"$f":"IF(D73=0,C73+J73,D73+J73)","v":0}]
["Motor Vehicle Allowance",null,null,null,null,null,null,null,null,{"$f":"SUM(E74:I74)","v":0},{"$f":"IF(D74=0,C74+J74,D74+J74)","v":0}]
["Cellphone Allowance",null,null,null,null,null,null,null,null,{"$f":"SUM(E75:I75)","v":0},{"$f":"IF(D75=0,C75+J75,D75+J75)","v":0}]
["Housing Allowances",null,null,null,null,null,null,null,null,0,0,""]
["Other benefits and allowances",null,null,null,null,null,null,null,null,{"$f":"SUM(E77:I77)","v":0},{"$f":"IF(D77=0,C77+J77,D77+J77)","v":0}]
["Payments in lieu of leave",null,null,null,null,null,null,null,null,0,0,""]
["Long service awards",null,null,null,null,null,null,null,null,0,0,""]
["Post-retirement benefit obligations",5,null,null,null,null,null,null,null,0,0,""]
["Sub Total - Senior Managers of Entities",null,{"$f":"SUM(C69:C80)","v":0},0,0,0,0,0,0,0,0,""]
[{"$f":"$A$15","v":"% increase"}]
[]
["Other Staff of Entities"]
["Basic Salaries and Wages",null,null,null,null,null,null,null,null,{"$f":"SUM(E85:I85)","v":0},{"$f":"IF(D85=0,C85+J85,D85+J85)","v":0},{"$f":"IF(K85=0,\"\",(K85/C85)-1)","v":""}]
["Pension and UIF Contributions",null,null,null,null,null,null,null,null,0,0,""]
["Medical Aid Contributions",null,null,null,null,null,null,null,null,0,0,""]
["Overtime",null,null,null,null,null,null,null,null,0,0,""]
["Performance Bonus",null,null,null,null,null,null,null,null,{"$f":"SUM(E89:I89)","v":0},{"$f":"IF(D89=0,C89+J89,D89+J89)","v":0}]
["Motor Vehicle Allowance",null,null,null,null,null,null,null,null,0,0,""]
["Cellphone Allowance",null,null,null,null,null,null,null,null,0,0,""]
["Housing Allowances",null,null,null,null,null,null,null,null,{"$f":"SUM(E92:I92)","v":0},{"$f":"IF(D92=0,C92+J92,D92+J92)","v":0}]
["Other benefits and allowances",null,null,null,null,null,null,null,null,{"$f":"SUM(E93:I93)","v":0},{"$f":"IF(D93=0,C93+J93,D93+J93)","v":0}]
["Payments in lieu of leave",null,null,null,null,null,null,null,null,0,0,""]
["Long service awards",null,null,null,null,null,null,null,null,0,0,""]
["Post-retirement benefit obligations",5,null,null,null,null,null,null,null,0,0,""]
["Sub Total - Other Staff of Entities",null,{"$f":"SUM(C85:C96)","v":0},0,0,0,0,0,0,0,0,""]
[{"$f":"$A$15","v":"% increase"}]
["Total Municipal Entities",null,{"$f":"C65+C81+C97","v":0},0,0,0,0,0,0,0,0,{"$f":"IF(K99=0,\"\",(K99/C99)-1)","v":""}]
[]
["TOTAL SALARY, ALLOWANCES & BENEFITS",null,{"$f":"C48+C99","v":100771651.69076073},0,0,0,0,0,17376679,17376679,118148330.69076073,{"$f":"IF(K101=0,\"\",(K101/C101)-1)","v":0.17243618327626553}]
[{"$f":"$A$15","v":"% increase"}]
["TOTAL MANAGERS AND STAFF",null,{"$f":"C30+C46+C81+C97","v":78303796.760000005},0,0,0,0,0,16962502,16962502,95266298.760000005,{"$f":"IF(K103=0,\"\",(K103/C103)-1)","v":0.21662425963826282}]
[{"$f":"head27a","v":"References"}]
["1. Include 'Loans and advances' where applicable if any reportable amounts only until phased compliance with s164 of MFMA achieved"]
["2. If benefits in kind are provided (e.g. provision of living quarters) the full market value must be shown as the cost to the municipality"]
["3. s57 of the Systems Act"]
["4. Must agree to the sub-total appearing on Table C1 (Employee costs)"]
["5. Includes pension payments and employer contributions to medical aid"]
[]
["Column Definitions:"]
["A. The original budget approved by council for the current year"]
["5. Only complete if a previous adjusted budget has been approved in the same financial year. Reflect most recent adjusted budget."]
["6. Additional cash-backed accumulated funds/unspent funds (section 18(1)(b) and section 28(2)(e) MFMA) identified after Original Budget approved and after annual financial statements audited (note: only where underspending could not reasonably be have for"]
["7. Increases of funds approved under section 31 MFMA"]
["8. Adjustments approved in accordance with section 29 MFMA"]
["9. Adjustments caused by changes in funding allocations from National or Provincial Government"]
["10. Adjusts. = 'Other' Adjustments proposed to be approved; including revenue under-collection (MFMA section 28(2)(a)); additional revenue appropriation on existing programmes (section 28(2))(b); projected savings (section 28(2)(d)); error correction (sec"]
["11. G = B + C + D + E +  F"]
["12. Adjusted Budget H = (A or A1/2 etc) + G"]

{"sheet":"SB12","index":30,"n_rows":43,"n_cols":18,"rows_kept":43,"cut":false,"hidden":false,"merged":[[1,0,2,0],[1,2,1,13],[1,1,2,1]]}
[{"$f":"muni&\" - \"&ADJB12&\" - \"&Date","v":"LIM332 Greater Letaba - Supporting Table SB12 Adjustments Budget - monthly revenue and expenditure (municipal vote) - 27 February 2019"}]
[{"$f":"desc","v":"Description"},{"$f":"head27","v":"Ref"},{"$f":"Head2","v":"Budget Year 2018/19"},null,null,null,null,null,null,null,null,null,null,null,null,"Medium Term Revenue and Expenditure Framework"]
[null,null,"July","August","Sept.","October","November","December","January","February","March","April","May","June","Full year budget",{"$f":"Head9","v":"Budget Year 2018/19"},{"$f":"Head10","v":"Budget Year +1 2019/20"},{"$f":"Head11","v":"Budget Year +2 2020/21"}]
["R thousands",null,{"$f":"Head5A","v":"Outcome"},"Outcome","Outcome","Outcome","Outcome","Outcome",{"$f":"Head7","v":"Adjusted Budget"},"Adjusted Budget","Adjusted Budget","Adjusted Budget","Adjusted Budget","Adjusted Budget",null,{"$f":"Head7","v":"Adjusted Budget"},"Adjusted Budget","Adjusted Budget"]
[{"$f":"'B3-FinPerf V'!A6","v":"Revenue by Vote"}]
[{"$f":"'B3-FinPerf V'!A7","v":"Vote 1 - Executive & Council"},null,0,0,null,null,null,null,null,null,null,null,null,{"$f":"P6-SUM(C6:M6)","v":0},{"$f":"SUM(C6:N6)","v":0},{"$f":"'B3-FinPerf V'!K7","v":0},{"$f":"'B3-FinPerf V'!L7","v":0},{"$f":"'B3-FinPerf V'!M7","v":0}]
[{"$f":"'B3-FinPerf V'!A8","v":"Vote 2 - Finance and Administration"},null,{"$f":"35556000+340301+3316+62736+1024763+100531000+706908","v":138225024},{"$f":"145894+5429+62709+1036239+2526000+282240","v":4058511},{"$f":"247296+883+62253+1052880+126110","v":1489422},{"$f":"253776+63495+2000000+64833","v":2382104},{"$f":"234981+15246+61562+1806676+59671","v":2178136},{"$f":"119758+4043+54437+1330280+81210000+215433+10741000","v":93674951},3569000,{"$f":"37500000+1489000","v":38989000},{"$f":"61000000+10471000","v":71471000},9875000,6987000,8690372.9700000286,381589520.97000003,{"$f":"'B3-FinPerf V'!K8","v":381589520.97000003},{"$f":"'B3-FinPerf V'!L8","v":384096221},{"$f":"'B3-FinPerf V'!M8","v":413827901.5}]
[{"$f":"'B3-FinPerf V'!A9","v":"Vote 3 - Internal Audit"},null,0,0,0,0,0,0,0,0,0,0,0,0,0,{"$f":"'B3-FinPerf V'!K9","v":0},{"$f":"'B3-FinPerf V'!L9","v":0},{"$f":"'B3-FinPerf V'!M9","v":0}]
[{"$f":"'B3-FinPerf V'!A10","v":"Vote 4 - Community and Public Safety"},null,0,0,0,0,0,0,0,0,0,0,0,0,0,{"$f":"'B3-FinPerf V'!K10","v":0},{"$f":"'B3-FinPerf V'!L10","v":0},{"$f":"'B3-FinPerf V'!M10","v":0}]
[{"$f":"'B3-FinPerf V'!A11","v":"Vote 5 - Sports and Recreation"},null,0,0,0,0,0,0,0,0,0,0,0,0,0,{"$f":"'B3-FinPerf V'!K11","v":0},{"$f":"'B3-FinPerf V'!L11","v":0},{"$f":"'B3-FinPerf V'!M11","v":0}]
[{"$f":"'B3-FinPerf V'!A12","v":"Vote 6 - Housing"},null,0,0,0,0,0,0,0,0,0,0,0,0,0,{"$f":"'B3-FinPerf V'!K12","v":0},{"$f":"'B3-FinPerf V'!L12","v":0},{"$f":"'B3-FinPerf V'!M12","v":0}]
[{"$f":"'B3-FinPerf V'!A13","v":"Vote 7 - Planning and development "},null,0,0,0,0,0,0,0,0,0,0,0,0,0,{"$f":"'B3-FinPerf V'!K13","v":0},{"$f":"'B3-FinPerf V'!L13","v":0},{"$f":"'B3-FinPerf V'!M13","v":0}]
[{"$f":"'B3-FinPerf V'!A14","v":"Vote 8 - Road Transport"},null,{"$f":"9100+1281356","v":1290456},{"$f":"6275+1355115+394478","v":1755868},{"$f":"3534+1189501","v":1193035},1177999,{"$f":"3546+1631888","v":1635434},{"$f":"6200+1064869","v":1071069},3587400,2900000,2854000,2398000,3587400,2610358,26061019,{"$f":"'B3-FinPerf V'!K14","v":26061019},{"$f":"'B3-FinPerf V'!L14","v":27754985},{"$f":"'B3-FinPerf V'!M14","v":29559059}]
[{"$f":"'B3-FinPerf V'!A15","v":"Vote 9 - Energy Sources"},null,{"$f":"980865+2417","v":983282},{"$f":"751288+2313","v":753601},{"$f":"617206+2157","v":619363},{"$f":"821378+2470","v":823848},{"$f":"268544+312151","v":580695},{"$f":"625868+658534","v":1284402},2542000,3542000,3841000,4854000,6637200,6769553.4699999988,33230944.469999999,{"$f":"'B3-FinPerf V'!K15","v":33230944.469999999},{"$f":"'B3-FinPerf V'!L15","v":36672060},{"$f":"'B3-FinPerf V'!M15","v":40229469}]
[{"$f":"'B3-FinPerf V'!A16","v":"Vote 10 - Waste Water Management"},null,0,0,0,0,0,0,0,0,0,0,0,0,null,{"$f":"'B3-FinPerf V'!K16","v":0},{"$f":"'B3-FinPerf V'!L16","v":0},{"$f":"'B3-FinPerf V'!M16","v":0}]
[{"$f":"'B3-FinPerf V'!A17","v":"Vote 11 - Waste Management"},null,101626,109070,74076,137964,147832,59980,254000,498000,1001000,1895000,1522600,2442249,null,{"$f":"'B3-FinPerf V'!K17","v":8243397},{"$f":"'B3-FinPerf V'!L17","v":7714217},{"$f":"'B3-FinPerf V'!M17","v":8215642}]
[{"$f":"'B3-FinPerf V'!A18","v":"Vote 12 - [NAME OF VOTE 12]"},null,0,0,0,0,0,0,0,0,0,0,0,0,null,{"$f":"'B3-FinPerf V'!K18","v":0},{"$f":"'B3-FinPerf V'!L18","v":0},{"$f":"'B3-FinPerf V'!M18","v":0}]
[{"$f":"'B3-FinPerf V'!A19","v":"Vote 13 - [NAME OF VOTE 13]"},null,0,0,0,0,0,0,0,0,0,0,0,0,null,{"$f":"'B3-FinPerf V'!K19","v":0},{"$f":"'B3-FinPerf V'!L19","v":0},{"$f":"'B3-FinPerf V'!M19","v":0}]
[{"$f":"'B3-FinPerf V'!A20","v":"Vote 14 - [NAME OF VOTE 14]"},null,0,0,0,0,0,0,0,0,0,0,0,0,null,{"$f":"'B3-FinPerf V'!K20","v":0},{"$f":"'B3-FinPerf V'!L20","v":0},{"$f":"'B3-FinPerf V'!M20","v":0}]
[{"$f":"'B3-FinPerf V'!A21","v":"Vote 15 - [NAME OF VOTE 15]"},null,0,0,0,0,0,0,0,0,0,0,0,0,{"$f":"SUM(C20:N20)","v":0},{"$f":"'B3-FinPerf V'!K21","v":0},{"$f":"'B3-FinPerf V'!L21","v":0},{"$f":"'B3-FinPerf V'!M21","v":0}]
[{"$f":"'B3-FinPerf V'!A22","v":"Total Revenue by Vote"},null,{"$f":"SUM(C6:C20)","v":140600388},6677050,3375896,4521915,4542097,96090402,9952400,45929000,79167000,19022000,18734200,20512533.440000027,440881484.44000006,449124881.44000006,456237483,491832071.5]
[]
[{"$f":"'B3-FinPerf V'!A24","v":"Expenditure by Vote"}]
[{"$f":"'B3-FinPerf V'!A25","v":"Vote 1 - Executive & Council"},null,2863654,4374829,4329771,4433841,4433841,7928117,3317269,3541000,4100000,3894000,4521000,{"$f":"P24-SUM(C24:M24)","v":4645799.1699999943},{"$f":"SUM(C24:N24)","v":52383121.169999994},{"$f":"'B3-FinPerf V'!K25","v":52383121.169999994},{"$f":"'B3-FinPerf V'!L25","v":56492940},{"$f":"'B3-FinPerf V'!M25","v":60004430}]
[{"$f":"'B3-FinPerf V'!A26","v":"Vote 2 - Finance and Administration"},null,4426713,7154078,8193438,8174277,8174277,15762859,6707169,5412000,6061800,6874000,6251000,7710098.6899999976,90901709.689999998,{"$f":"'B3-FinPerf V'!K26","v":90901709.689999998},{"$f":"'B3-FinPerf V'!L26","v":97198856},{"$f":"'B3-FinPerf V'!M26","v":103377226}]
[{"$f":"'B3-FinPerf V'!A27","v":"Vote 3 - Internal Audit"},null,113360,140475,133178,132219,132219,196970,157386,254000,352000,252000,289000,314146.02,2466953.02,{"$f":"'B3-FinPerf V'!K27","v":2466953.02},{"$f":"'B3-FinPerf V'!L27","v":2627305},{"$f":"'B3-FinPerf V'!M27","v":2798080}]
[{"$f":"'B3-FinPerf V'!A28","v":"Vote 4 - Community and Public Safety"},null,268117,337371,441731,296998,296998,345619,294257,365000,246000,651000,698000,775127.1799999997,5016218.18,{"$f":"'B3-FinPerf V'!K28","v":5016218.18},{"$f":"'B3-FinPerf V'!L28","v":5342273},{"$f":"'B3-FinPerf V'!M28","v":5689520}]
[{"$f":"'B3-FinPerf V'!A29","v":"Vote 5 - Sports and Recreation"},null,976460,1144415,980913,1001719,1001719,985922,932831,824000,952000,980000,1200000,1349949.4299999997,12329928.43,{"$f":"'B3-FinPerf V'!K29","v":12329928.43},{"$f":"'B3-FinPerf V'!L29","v":13131373},{"$f":"'B3-FinPerf V'!M29","v":13984913}]
[{"$f":"'B3-FinPerf V'!A30","v":"Vote 6 - Housing"},null,51484,60934,56861,55661,55661,57666,54958,66800,63000,69000,66800,68674.109999999986,727499.11,{"$f":"'B3-FinPerf V'!K30","v":727499.11},{"$f":"'B3-FinPerf V'!L30","v":774786},{"$f":"'B3-FinPerf V'!M30","v":825147}]
[{"$f":"'B3-FinPerf V'!A31","v":"Vote 7 - Planning and development "},null,592990,686782,1474054,709691,709691,765624,688470,998000,984000,998000,1210000,1769248.4800000004,11586550.48,{"$f":"'B3-FinPerf V'!K31","v":11586550.48},{"$f":"'B3-FinPerf V'!L31","v":12339676},{"$f":"'B3-FinPerf V'!M31","v":13141754}]
[{"$f":"'B3-FinPerf V'!A32","v":"Vote 8 - Road Transport"},null,3240681,2462143,3713806,2771738,2771738,16446802,6507866,2800000,1520000,6500000,3512000,1584605.2600000054,53831379.260000005,{"$f":"'B3-FinPerf V'!K32","v":53831379.260000005},{"$f":"'B3-FinPerf V'!L32","v":44715946},{"$f":"'B3-FinPerf V'!M32","v":47576997}]
[{"$f":"'B3-FinPerf V'!A33","v":"Vote 9 - Energy Sources"},null,2387408,2367805,3005143,1885737,1885737,6034510,1632093,7520000,1952000,2367805,5421000,3990923.7199999988,40450161.719999999,{"$f":"'B3-FinPerf V'!K33","v":40450161.719999999},{"$f":"'B3-FinPerf V'!L33","v":43079420},{"$f":"'B3-FinPerf V'!M33","v":45879583}]
[{"$f":"'B3-FinPerf V'!A34","v":"Vote 10 - Waste Water Management"},null,45244,52145,48241,52046,52046,48497,68624,81000,95000,52000,48000,57614,700457,{"$f":"'B3-FinPerf V'!K34","v":700457},{"$f":"'B3-FinPerf V'!L34","v":745986},{"$f":"'B3-FinPerf V'!M34","v":794475}]
[{"$f":"'B3-FinPerf V'!A35","v":"Vote 11 - Waste Management"},null,330430,228724,572345,445757,445757,437015,534536,415000,521000,298000,436000,405039.46999999974,5069603.47,{"$f":"'B3-FinPerf V'!K35","v":5069603.47},{"$f":"'B3-FinPerf V'!L35","v":5399128},{"$f":"'B3-FinPerf V'!M35","v":5750071}]
[{"$f":"'B3-FinPerf V'!A36","v":"Vote 12 - [NAME OF VOTE 12]"},null,0,0,0,0,0,0,0,0,0,0,0,0,0,{"$f":"'B3-FinPerf V'!K36","v":0},{"$f":"'B3-FinPerf V'!L36","v":0},{"$f":"'B3-FinPerf V'!M36","v":0}]
[{"$f":"'B3-FinPerf V'!A37","v":"Vote 13 - [NAME OF VOTE 13]"},null,0,0,0,0,0,0,0,0,0,0,0,0,0,{"$f":"'B3-FinPerf V'!K37","v":0},{"$f":"'B3-FinPerf V'!L37","v":0},{"$f":"'B3-FinPerf V'!M37","v":0}]
[{"$f":"'B3-FinPerf V'!A38","v":"Vote 14 - [NAME OF VOTE 14]"},null,0,0,0,0,0,0,0,0,0,0,0,0,0,{"$f":"'B3-FinPerf V'!K38","v":0},{"$f":"'B3-FinPerf V'!L38","v":0},{"$f":"'B3-FinPerf V'!M38","v":0}]
[{"$f":"'B3-FinPerf V'!A39","v":"Vote 15 - [NAME OF VOTE 15]"},null,0,0,0,0,0,0,0,0,0,0,0,0,0,{"$f":"'B3-FinPerf V'!K39","v":0},{"$f":"'B3-FinPerf V'!L39","v":0},{"$f":"'B3-FinPerf V'!M39","v":0}]
["Total Expenditure by Vote",null,{"$f":"SUM(C24:C38)","v":15296541},19009701,22949481,19959684,19959684,49009601,20895459,22276800,16846800,22935805,23652800,22671225.529999994,275463581.53000009,275463581.53000009,281847689,299822196]
[]
["Surplus/ (Deficit)",null,{"$f":"C21-C39","v":125303847},-12332651,-19573585,-15437769,-15417587,47080801,-10943059,23652200,62320200,-3913805,-4918600,-2158692.0899999663,165417902.90999997,173661299.90999997,174389794,192009875.5]
[{"$f":"head27a","v":"References"}]
["1. Surplus (Deficit) must reconcile with budget table A2 and monthly budget statement table C2"]

{"sheet":"SB13","index":31,"n_rows":53,"n_cols":18,"rows_kept":53,"cut":false,"hidden":false,"merged":[[1,0,2,0],[1,1,2,1],[1,2,1,13]]}
[{"$f":"muni&\" - \"&ADJB13&\" - \"&Date","v":"LIM332 Greater Letaba - Supporting Table SB13 Adjustments Budget - monthly revenue and expenditure (functional classification) - 27 February 2019"}]
[{"$f":"desc&\" - Standard classification\"","v":"Description - Standard classification"},{"$f":"head27","v":"Ref"},{"$f":"Head2","v":"Budget Year 2018/19"},null,null,null,null,null,null,null,null,null,null,null,null,"Medium Term Revenue and Expenditure Framework"]
[null,null,"July","August","Sept.","October","November","December","January","February","March","April","May","June","Full year budget",{"$f":"Head9","v":"Budget Year 2018/19"},{"$f":"Head10","v":"Budget Year +1 2019/20"},{"$f":"Head11","v":"Budget Year +2 2020/21"}]
["R thousands",null,{"$f":"Head5A","v":"Outcome"},"Outcome","Outcome","Outcome","Outcome","Outcome",{"$f":"Head7","v":"Adjusted Budget"},"Adjusted Budget","Adjusted Budget","Adjusted Budget","Adjusted Budget","Adjusted Budget",null,{"$f":"Head7","v":"Adjusted Budget"},{"$f":"Head7","v":"Adjusted Budget"},{"$f":"Head7","v":"Adjusted Budget"}]
["Revenue - Functional"]
[{"$f":"'B2-FinPerf SC'!A7","v":"Governance and administration"},null,{"$f":"SUM(C7:C9)","v":138225024},4058511,1489422,2382104,2178136,93674951,3569000,38989000,71471000,9875000,6987000,{"$f":"P6-SUM(C6:M6)","v":8690372.9700000286},{"$f":"SUM(C6:N6)","v":381589520.97000003},{"$f":"'B2-FinPerf SC'!K7","v":381589520.97000003},{"$f":"'B2-FinPerf SC'!L7","v":384096221},{"$f":"'B2-FinPerf SC'!M7","v":413827901.5}]
[{"$f":"'B2-FinPerf SC'!A8","v":"Executive and council"},null,0,0,0,0,0,0,0,0,0,0,0,0,0,{"$f":"'B2-FinPerf SC'!K8","v":0},{"$f":"'B2-FinPerf SC'!L8","v":0},{"$f":"'B2-FinPerf SC'!M8","v":0}]
[{"$f":"'B2-FinPerf SC'!A9","v":"Finance and administration"},null,{"$f":"35556000+340301+3316+62736+1024763+100531000+706908","v":138225024},{"$f":"145894+5429+62709+1036239+2526000+282240","v":4058511},{"$f":"247296+883+62253+1052880+126110","v":1489422},{"$f":"253776+63495+2000000+64833","v":2382104},{"$f":"234981+15246+61562+1806676+59671","v":2178136},{"$f":"119758+4043+54437+1330280+81210000+215433+10741000","v":93674951},3569000,{"$f":"37500000+1489000","v":38989000},{"$f":"61000000+10471000","v":71471000},9875000,6987000,8690372.9700000286,381589520.97000003,{"$f":"'B2-FinPerf SC'!K9","v":381589520.97000003},{"$f":"'B2-FinPerf SC'!L9","v":384096221},{"$f":"'B2-FinPerf SC'!M9","v":413827901.5}]
[{"$f":"'B2-FinPerf SC'!A10","v":"Internal audit"},null,0,0,0,0,0,0,0,0,0,0,0,0,0,{"$f":"'B2-FinPerf SC'!K10","v":0},{"$f":"'B2-FinPerf SC'!L10","v":0},{"$f":"'B2-FinPerf SC'!M10","v":0}]
[{"$f":"'B2-FinPerf SC'!A11","v":"Community and public safety"},null,{"$f":"SUM(C11:C15)","v":0},0,0,0,0,0,0,0,0,0,0,0,0,{"$f":"'B2-FinPerf SC'!K11","v":0},{"$f":"'B2-FinPerf SC'!L11","v":0},{"$f":"'B2-FinPerf SC'!M11","v":0}]
[{"$f":"'B2-FinPerf SC'!A12","v":"Community and social services"},null,0,0,0,0,0,0,0,0,0,0,0,0,0,{"$f":"'B2-FinPerf SC'!K12","v":0},{"$f":"'B2-FinPerf SC'!L12","v":0},{"$f":"'B2-FinPerf SC'!M12","v":0}]
[{"$f":"'B2-FinPerf SC'!A13","v":"Sport and recreation"},null,0,0,0,0,0,0,0,0,0,0,0,0,0,{"$f":"'B2-FinPerf SC'!K13","v":0},{"$f":"'B2-FinPerf SC'!L13","v":0},{"$f":"'B2-FinPerf SC'!M13","v":0}]
[{"$f":"'B2-FinPerf SC'!A14","v":"Public safety"},null,0,0,0,0,0,0,0,0,0,0,0,0,0,{"$f":"'B2-FinPerf SC'!K14","v":0},{"$f":"'B2-FinPerf SC'!L14","v":0},{"$f":"'B2-FinPerf SC'!M14","v":0}]
[{"$f":"'B2-FinPerf SC'!A15","v":"Housing"},null,0,0,0,0,0,0,0,0,0,0,0,0,0,{"$f":"'B2-FinPerf SC'!K15","v":0},{"$f":"'B2-FinPerf SC'!L15","v":0},{"$f":"'B2-FinPerf SC'!M15","v":0}]
[{"$f":"'B2-FinPerf SC'!A16","v":"Health"},null,0,0,0,0,0,0,0,0,0,0,0,0,0,{"$f":"'B2-FinPerf SC'!K16","v":0},{"$f":"'B2-FinPerf SC'!L16","v":0},{"$f":"'B2-FinPerf SC'!M16","v":0}]
[{"$f":"'B2-FinPerf SC'!A17","v":"Economic and environmental services"},null,{"$f":"SUM(C17:C19)","v":1290456},1755868,1193035,1177999,1635434,1071069,3587400,2900000,2854000,2398000,3587400,2610358,26061019,{"$f":"'B2-FinPerf SC'!K17","v":26061019},{"$f":"'B2-FinPerf SC'!L17","v":27754985},{"$f":"'B2-FinPerf SC'!M17","v":29559059}]
[{"$f":"'B2-FinPerf SC'!A18","v":"Planning and development"},null,null,null,null,null,null,null,null,null,null,null,null,0,0,{"$f":"'B2-FinPerf SC'!K18","v":0},{"$f":"'B2-FinPerf SC'!L18","v":0},{"$f":"'B2-FinPerf SC'!M18","v":0}]
[{"$f":"'B2-FinPerf SC'!A19","v":"Road transport"},null,{"$f":"9100+1281356","v":1290456},{"$f":"6275+1355115+394478","v":1755868},{"$f":"3534+1189501","v":1193035},1177999,{"$f":"3546+1631888","v":1635434},{"$f":"6200+1064869","v":1071069},3587400,2900000,2854000,2398000,3587400,2610358,26061019,{"$f":"'B2-FinPerf SC'!K19","v":26061019},{"$f":"'B2-FinPerf SC'!L19","v":27754985},{"$f":"'B2-FinPerf SC'!M19","v":29559059}]
[{"$f":"'B2-FinPerf SC'!A20","v":"Environmental protection"},null,null,null,null,null,null,null,null,null,null,null,null,0,0,{"$f":"'B2-FinPerf SC'!K20","v":0},{"$f":"'B2-FinPerf SC'!L20","v":0},{"$f":"'B2-FinPerf SC'!M20","v":0}]
[{"$f":"'B2-FinPerf SC'!A21","v":"Trading services"},null,{"$f":"SUM(C21:C24)","v":1084908},{"$f":"SUM(D21:D24)","v":862671},693439,961812,728527,1344382,2796000,4040000,4842000,6749000,8159800,{"$f":"P20-SUM(C20:M20)","v":9211802.4699999988},41474341.469999999,{"$f":"'B2-FinPerf SC'!K21","v":41474341.469999999},{"$f":"'B2-FinPerf SC'!L21","v":44386277},{"$f":"'B2-FinPerf SC'!M21","v":48445111}]
[{"$f":"'B2-FinPerf SC'!A22","v":"Energy sources"},null,{"$f":"980865+2417","v":983282},{"$f":"751288+2313","v":753601},{"$f":"617206+2157","v":619363},{"$f":"821378+2470","v":823848},{"$f":"268544+312151","v":580695},{"$f":"625868+658534","v":1284402},2542000,3542000,3841000,4854000,6637200,6769553.4699999988,33230944.469999999,{"$f":"'B2-FinPerf SC'!K22","v":33230944.469999999},{"$f":"'B2-FinPerf SC'!L22","v":36672060},{"$f":"'B2-FinPerf SC'!M22","v":40229469}]
[{"$f":"'B2-FinPerf SC'!A23","v":"Water management"},null,0,0,0,0,0,0,0,0,0,0,0,0,0,{"$f":"'B2-FinPerf SC'!K23","v":0},{"$f":"'B2-FinPerf SC'!L23","v":0},{"$f":"'B2-FinPerf SC'!M23","v":0}]
[{"$f":"'B2-FinPerf SC'!A24","v":"Waste water management"},null,0,0,0,0,0,0,0,0,0,0,0,0,0,{"$f":"'B2-FinPerf SC'!K24","v":0},{"$f":"'B2-FinPerf SC'!L24","v":0},{"$f":"'B2-FinPerf SC'!M24","v":0}]
[{"$f":"'B2-FinPerf SC'!A25","v":"Waste management"},null,101626,109070,74076,137964,147832,59980,254000,498000,1001000,1895000,1522600,2442249,8243397,{"$f":"'B2-FinPerf SC'!K25","v":8243397},{"$f":"'B2-FinPerf SC'!L25","v":7714217},{"$f":"'B2-FinPerf SC'!M25","v":8215642}]
[{"$f":"'B2-FinPerf SC'!A26","v":"Other"},null,0,0,0,0,0,0,0,0,0,0,0,0,0,{"$f":"'B2-FinPerf SC'!K26","v":0},{"$f":"'B2-FinPerf SC'!L26","v":0},{"$f":"'B2-FinPerf SC'!M26","v":0}]
["Total Revenue - Functional",null,{"$f":"C6+C10+C16+C20+C25","v":140600388},{"$f":"D6+D10+D16+D20+D25","v":6677050},{"$f":"E6+E10+E16+E20+E25","v":3375896},{"$f":"F6+F10+F16+F20+F25","v":4521915},4542097,96090402,9952400,45929000,79167000,19022000,18734200,20512533.440000027,449124881.44000006,449124881.44000006,456237483,491832071.5]
[]
["Expenditure - Functional"]
[{"$f":"A6","v":"Governance and administration"},null,{"$f":"SUM(C30:C32)","v":7403727},11669382,12656387,12740337,12740337,23887946,10181824,9207000,10513800,11020000,11061000,{"$f":"P29-SUM(C29:M29)","v":12669928.879999995},{"$f":"SUM(C29:N29)","v":145751668.88},{"$f":"'B2-FinPerf SC'!K30","v":145751668.88},{"$f":"'B2-FinPerf SC'!L30","v":156319101},{"$f":"'B2-FinPerf SC'!M30","v":166179736}]
["Executive and council",null,2863654,4374829,4329771,4433841,4433841,7928117,3317269,3541000,4100000,3894000,4521000,4645797.1699999943,52383119.169999994,{"$f":"'B2-FinPerf SC'!K31","v":52383119.169999994},{"$f":"'B2-FinPerf SC'!L31","v":56492940},{"$f":"'B2-FinPerf SC'!M31","v":60004430}]
["Finance and administration",null,4426713,7154078,8193438,8174277,8174277,15762859,6707169,5412000,6061800,6874000,6251000,7709985.6899999976,90901596.689999998,{"$f":"'B2-FinPerf SC'!K32","v":90901596.689999998},{"$f":"'B2-FinPerf SC'!L32","v":97198856},{"$f":"'B2-FinPerf SC'!M32","v":103377226}]
["Internal audit",null,113360,140475,133178,132219,132219,196970,157386,254000,352000,252000,289000,314146.02,2466953.02,{"$f":"'B2-FinPerf SC'!K33","v":2466953.02},{"$f":"'B2-FinPerf SC'!L33","v":2627305},{"$f":"'B2-FinPerf SC'!M33","v":2798080}]
["Community and public safety",null,{"$f":"SUM(C34:C38)","v":1296061},1542720,1479505,1354378,1354378,1389207,1282046,1255800,1261000,1700000,1964800,2193750.7199999988,18073645.719999999,{"$f":"'B2-FinPerf SC'!K34","v":18073645.719999999},{"$f":"'B2-FinPerf SC'!L34","v":19248432},{"$f":"'B2-FinPerf SC'!M34","v":20499580}]
["Community and social services",null,268117,337371,441731,296998,296998,345619,294257,365000,246000,651000,698000,775127.1799999997,5016218.18,{"$f":"'B2-FinPerf SC'!K35","v":5016218.18},{"$f":"'B2-FinPerf SC'!L35","v":5342273},{"$f":"'B2-FinPerf SC'!M35","v":5689520}]
["Sport and recreation",null,976460,1144415,980913,1001719,1001719,985922,932831,824000,952000,980000,1200000,1349949.4299999997,12329928.43,{"$f":"'B2-FinPerf SC'!K36","v":12329928.43},{"$f":"'B2-FinPerf SC'!L36","v":13131373},{"$f":"'B2-FinPerf SC'!M36","v":13984913}]
["Public safety",null,0,0,0,0,0,0,0,0,0,0,0,0,0,{"$f":"'B2-FinPerf SC'!K37","v":0},{"$f":"'B2-FinPerf SC'!L37","v":0},{"$f":"'B2-FinPerf SC'!M37","v":0}]
["Housing",null,51484,60934,56861,55661,55661,57666,54958,66800,63000,69000,66800,68674.109999999986,727499.11,{"$f":"'B2-FinPerf SC'!K38","v":727499.11},{"$f":"'B2-FinPerf SC'!L38","v":774786},{"$f":"'B2-FinPerf SC'!M38","v":825147}]
["Health",null,0,0,0,0,0,0,0,0,0,0,0,0,null,{"$f":"'B2-FinPerf SC'!K39","v":0},{"$f":"'B2-FinPerf SC'!L39","v":0},{"$f":"'B2-FinPerf SC'!M39","v":0}]
["Economic and environmental services",null,{"$f":"SUM(C40:C42)","v":3833671},3148925,5187860,3481429,3481429,17212426,7196336,3798000,2504000,7498000,4722000,3353853.7400000095,null,{"$f":"'B2-FinPerf SC'!K40","v":65417929.74000001},{"$f":"'B2-FinPerf SC'!L40","v":57055622},{"$f":"'B2-FinPerf SC'!M40","v":60718751}]
["Planning and development",null,592990,686782,1474054,709691,709691,765624,688470,998000,984000,998000,1210000,1769248.4800000004,null,{"$f":"'B2-FinPerf SC'!K41","v":11586550.48},{"$f":"'B2-FinPerf SC'!L41","v":12339676},{"$f":"'B2-FinPerf SC'!M41","v":13141754}]
["Road transport",null,3240681,2462143,3713806,2771738,2771738,16446802,6507866,2800000,1520000,6500000,3512000,1584605.2600000054,null,{"$f":"'B2-FinPerf SC'!K42","v":53831379.260000005},{"$f":"'B2-FinPerf SC'!L42","v":44715946},{"$f":"'B2-FinPerf SC'!M42","v":47576997}]
["Environmental protection",null,0,0,0,0,0,0,0,0,0,0,0,0,null,{"$f":"'B2-FinPerf SC'!K43","v":0},{"$f":"'B2-FinPerf SC'!L43","v":0},{"$f":"'B2-FinPerf SC'!M43","v":0}]
["Trading services",null,{"$f":"SUM(C44:C47)","v":2763082},{"$f":"SUM(D44:D47)","v":2648674},3625729,2383540,2383540,6520022,2235253,8016000,2568000,2717805,5905000,{"$f":"P43-SUM(C43:M43)","v":4453577.1899999976},{"$f":"SUM(C43:N43)","v":46220222.189999998},{"$f":"'B2-FinPerf SC'!K44","v":46220222.189999998},{"$f":"'B2-FinPerf SC'!L44","v":49224534},{"$f":"'B2-FinPerf SC'!M44","v":52424129}]
["Energy sources",null,2387408,2367805,3005143,1885737,1885737,6034510,1632093,7520000,1952000,2367805,5421000,3990923.7199999988,{"$f":"SUM(C44:N44)","v":40450161.719999999},{"$f":"'B2-FinPerf SC'!K45","v":40450161.719999999},{"$f":"'B2-FinPerf SC'!L45","v":43079420},{"$f":"'B2-FinPerf SC'!M45","v":45879583}]
["Water management",null,0,0,0,0,0,0,0,0,0,0,0,0,null,{"$f":"'B2-FinPerf SC'!K46","v":0},{"$f":"'B2-FinPerf SC'!L46","v":0},{"$f":"'B2-FinPerf SC'!M46","v":0}]
["Waste water management",null,45244,52145,48241,52046,52046,48497,68624,81000,95000,52000,48000,57614,null,{"$f":"'B2-FinPerf SC'!K47","v":700457},{"$f":"'B2-FinPerf SC'!L47","v":745986},{"$f":"'B2-FinPerf SC'!M47","v":794475}]
["Waste management",null,330430,228724,572345,445757,445757,437015,534536,415000,521000,298000,436000,405039.46999999974,null,{"$f":"'B2-FinPerf SC'!K48","v":5069603.47},{"$f":"'B2-FinPerf SC'!L48","v":5399128},{"$f":"'B2-FinPerf SC'!M48","v":5750071}]
["Other",null,0,0,0,0,0,0,0,0,0,0,0,0,null,{"$f":"'B2-FinPerf SC'!K49","v":0},{"$f":"'B2-FinPerf SC'!L49","v":0},{"$f":"'B2-FinPerf SC'!M49","v":0}]
["Total Expenditure - Functional",null,{"$f":"C29+C33+C39+C43+C48","v":15296541},{"$f":"D29+D33+D39+D43+D48","v":19009701},{"$f":"E29+E33+E39+E43+E48","v":22949481},{"$f":"F29+F33+F39+F43+F48","v":19959684},19959684,49009601,20895459,22276800,16846800,22935805,{"$f":"M29+M33+M39+M43+M48","v":23652800},22671110.530000001,210045536.78999999,275463466.52999997,281847689,299822196]
[]
["Surplus/ (Deficit) 1.",null,{"$f":"C26-C49","v":125303847},-12332651,-19573585,-15437769,-15417587,47080801,-10943059,23652200,62320200,-3913805,-4918600,-2158577.0899999738,239079344.65000007,173661414.91000009,174389794,192009875.5]
[{"$f":"head27a","v":"References"}]
["1. Surplus (Deficit) must reconcile with budget table A3 and monthly budget statement table C3"]

{"sheet":"SB14","index":32,"n_rows":45,"n_cols":18,"rows_kept":45,"cut":false,"hidden":false,"merged":[[1,0,2,0],[1,1,2,1],[1,2,1,13]]}
[{"$f":"muni&\" - \"&ADJB14&\" - \"&Date","v":"LIM332 Greater Letaba - Supporting Table SB14 Adjustments Budget - monthly revenue and expenditure - 27 February 2019"}]
[{"$f":"desc","v":"Description"},{"$f":"head27","v":"Ref"},{"$f":"Head2","v":"Budget Year 2018/19"},null,null,null,null,null,null,null,null,null,null,null,null,"Medium Term Revenue and Expenditure Framework"]
[null,null,"July","August","Sept.","October","November","December","January","February","March","April","May","June","Full year budget",{"$f":"Head9","v":"Budget Year 2018/19"},{"$f":"Head10","v":"Budget Year +1 2019/20"},{"$f":"Head11","v":"Budget Year +2 2020/21"}]
["R thousands",null,{"$f":"Head5A","v":"Outcome"},"Outcome","Outcome","Outcome","Outcome","Outcome",{"$f":"Head7","v":"Adjusted Budget"},"Adjusted Budget","Adjusted Budget","Adjusted Budget","Adjusted Budget","Adjusted Budget",null,{"$f":"Head7","v":"Adjusted Budget"},{"$f":"Head7","v":"Adjusted Budget"},{"$f":"Head7","v":"Adjusted Budget"}]
["Revenue By Source"]
["Property rates",null,4173,4531,1893897,891597,877403,875608,875608,1993897,2001000,1993608,2314000,{"$f":"P6-SUM(C6:M6)","v":3137964.5700000003},{"$f":"SUM(C6:N6)","v":16863286.57},{"$f":"'B4-FinPerf RE'!K7","v":16863286.57},{"$f":"'B4-FinPerf RE'!L7","v":16894401},{"$f":"'B4-FinPerf RE'!M7","v":17992537}]
["Service charges - electricity revenue",null,935155,930771,1571044,2290601,6368246,1290653,647513,1250000,1290653,2897000,3254000,1741007.2100000009,24466643.210000001,{"$f":"'B4-FinPerf RE'!K8","v":24466643.210000001},{"$f":"'B4-FinPerf RE'!L8","v":23926975},{"$f":"'B4-FinPerf RE'!M8","v":25482229}]
["Service charges - water revenue",null,0,0,0,0,0,0,0,0,0,0,0,0,0,{"$f":"'B4-FinPerf RE'!K9","v":0},{"$f":"'B4-FinPerf RE'!L9","v":0},{"$f":"'B4-FinPerf RE'!M9","v":0}]
["Service charges - sanitation revenue",null,0,0,0,0,0,0,0,0,0,0,0,0,0,{"$f":"'B4-FinPerf RE'!K10","v":0},{"$f":"'B4-FinPerf RE'!L10","v":0},{"$f":"'B4-FinPerf RE'!M10","v":0}]
["Service charges - refuse",null,434079,433864,433280,433066,433864,433804,434542,1200000,1005000,989000,975000,1037897.8199999994,8243396.8199999994,{"$f":"'B4-FinPerf RE'!K11","v":8243396.8199999994},{"$f":"'B4-FinPerf RE'!L11","v":7714218},{"$f":"'B4-FinPerf RE'!M11","v":8215642}]
["Service charges - other",null,0,0,0,0,0,0,0,0,0,0,0,0,0,{"$f":"'B4-FinPerf RE'!K12","v":0},{"$f":"'B4-FinPerf RE'!L12","v":0},{"$f":"'B4-FinPerf RE'!M12","v":0}]
["Rental of facilities and equipment",null,3316,5429,883,0,15246,4043,4528,234500,188000,124000,105000,271852.77,956797.77,{"$f":"'B4-FinPerf RE'!K13","v":956797.77},{"$f":"'B4-FinPerf RE'!L13","v":1018989},{"$f":"'B4-FinPerf RE'!M13","v":1085223}]
["Interest earned - external investments",null,62736,62709,62253,63496,61562,54437,54816,56700,61000,64000,65000,3850806.4400000004,4519515.4400000004,{"$f":"'B4-FinPerf RE'!K14","v":4519515.4400000004},{"$f":"'B4-FinPerf RE'!L14","v":4813283},{"$f":"'B4-FinPerf RE'!M14","v":5126147}]
["Interest earned - outstanding debtors",null,1024763,1036239,1052880,0,1806676,1330280,1330280,1950000,1806676,1846000,2425000,3618858.7699999996,19227652.77,{"$f":"'B4-FinPerf RE'!K15","v":19227652.77},{"$f":"'B4-FinPerf RE'!L15","v":18347450},{"$f":"'B4-FinPerf RE'!M15","v":19540035}]
["Dividends received",null,0,0,0,0,0,0,0,0,0,0,0,0,0,{"$f":"'B4-FinPerf RE'!K16","v":0},{"$f":"'B4-FinPerf RE'!L16","v":0},{"$f":"'B4-FinPerf RE'!M16","v":0}]
["Fines, penalties and forfeits",null,9100,6275,3534,0,3546,6200,4200,99875,111000,140000,180000,636270,1200000,{"$f":"'B4-FinPerf RE'!K17","v":1200000},{"$f":"'B4-FinPerf RE'!L17","v":1278000},{"$f":"'B4-FinPerf RE'!M17","v":1361070}]
["Licences and permits",null,1281356,1355115,1189501,1177999,1631888,1064869,1692925,2487000,3100000,2800000,2500000,2404351.6400000006,22685004.640000001,{"$f":"'B4-FinPerf RE'!K18","v":22685004.640000001},{"$f":"'B4-FinPerf RE'!L18","v":24159530},{"$f":"'B4-FinPerf RE'!M18","v":25729899}]
["Agency services",null,0,394478,0,0,0,0,0,456000,321000,221000,395000,388536.33000000007,2176014.33,{"$f":"'B4-FinPerf RE'!K19","v":2176014.33},{"$f":"'B4-FinPerf RE'!L19","v":2317455},{"$f":"'B4-FinPerf RE'!M19","v":2468089}]
["Transfers and subsidies",null,100531000,{"$f":"381000+2145000","v":2526000},0,2000000,0,81210000,0,3700000,{"$f":"62091000-3700000","v":58391000},0,0,0,248358000,{"$f":"'B4-FinPerf RE'!K20","v":248358000},{"$f":"'B4-FinPerf RE'!L20","v":274109000},{"$f":"'B4-FinPerf RE'!M20","v":297262000}]
["Other revenue",null,709325,{"$f":"70140+18329+193771+2313","v":284553},{"$f":"112736+13374+2157","v":128267},67751,371822,215433,{"$f":"485902+12436+310944","v":809282},5421000,6800000,7500000,8100000,7001135.6799999997,37408568.68,{"$f":"'B4-FinPerf RE'!K21","v":37408568.68},{"$f":"'B4-FinPerf RE'!L21","v":12799775},{"$f":"'B4-FinPerf RE'!M21","v":13631760}]
["Gains on disposal of PPE",null,0,0,0,0,0,0,0,0,0,0,0,577000,577000,{"$f":"'B4-FinPerf RE'!K22","v":577000},{"$f":"'B4-FinPerf RE'!L22","v":614505},{"$f":"'B4-FinPerf RE'!M22","v":654447}]
["Total Revenue",null,{"$f":"SUM(C6:C21)","v":104995003},7039964,6335539,6924510,11570253,86485327,5853694,18848972,75075329,18574608,20313000,24665681.230000004,386681880.23000002,386681880.23000002,387993581,418549078]
[]
["Expenditure By Type"]
["Employee related costs",null,7012242,7402217,7406896,7411710,7502874,7305283,{"$f":"8172227-68179-528975","v":7575073},7986000,8351000,8527200,8912000,{"$f":"P25-SUM(C25:M25)","v":9873797.25},{"$f":"SUM(C25:N25)","v":95266292.25},{"$f":"'B4-FinPerf RE'!K26","v":95266292.25},{"$f":"'B4-FinPerf RE'!L26","v":101544882},{"$f":"'B4-FinPerf RE'!M26","v":108008806}]
["Remuneration of councillors",null,1731493,1817240,1750536,1702753,1504630,1504630,1817240,2100000,2100000,2100000,2100000,2653510,22882032,{"$f":"'B4-FinPerf RE'!K27","v":22882032},{"$f":"'B4-FinPerf RE'!L27","v":24369368},{"$f":"'B4-FinPerf RE'!M27","v":25953376}]
["Debt impairment",null,0,0,0,0,0,0,0,0,0,0,0,1956620.19,1956620.19,{"$f":"'B4-FinPerf RE'!K28","v":1956620.19},{"$f":"'B4-FinPerf RE'!L28","v":2083801},{"$f":"'B4-FinPerf RE'!M28","v":2219248}]
["Depreciation & asset impairment",null,0,0,0,0,0,14427322.470000001,2051000,0,0,0,0,-10536111.66,5942210.8100000005,{"$f":"'B4-FinPerf RE'!K29","v":5942210.8099999996},{"$f":"'B4-FinPerf RE'!L29","v":6865248},{"$f":"'B4-FinPerf RE'!M29","v":7311489}]
["Finance charges",null,0,0,0,0,0,0,0,0,0,0,0,0,0,{"$f":"'B4-FinPerf RE'!K30","v":0},{"$f":"'B4-FinPerf RE'!L30","v":0},{"$f":"'B4-FinPerf RE'!M30","v":0}]
["Bulk purchases",null,1943765,1941629,2445230,1077018,0,2053470,925624,1077018,1250000,1347000,1495000,1540805,17096559,{"$f":"'B4-FinPerf RE'!K31","v":17096559},{"$f":"'B4-FinPerf RE'!L31","v":18207835},{"$f":"'B4-FinPerf RE'!M31","v":19391344}]
["Other materials",null,0,0,0,0,0,0,0,0,0,0,0,0,0,{"$f":"'B4-FinPerf RE'!K32","v":0},{"$f":"'B4-FinPerf RE'!L32","v":0},{"$f":"'B4-FinPerf RE'!M32","v":0}]
["Contracted services",null,777784,667912,2830276,2628462,735088,2037696,1411417,1540000,895000,1542000,1798000,2512530.5023999996,19376165.5024,{"$f":"'B4-FinPerf RE'!K33","v":19376165.5024},{"$f":"'B4-FinPerf RE'!L33","v":20635616},{"$f":"'B4-FinPerf RE'!M33","v":21976931}]
["Grants and subsidies",null,0,0,0,0,0,0,0,0,0,0,0,0,0,{"$f":"'B4-FinPerf RE'!K34","v":0},{"$f":"'B4-FinPerf RE'!L34","v":0},{"$f":"'B4-FinPerf RE'!M34","v":0}]
["Other expenditure",null,3831257,8821685,8484000,7139794,2837810,21681599,{"$f":"10458000-200000","v":10258000},2975000,12956000,9542000,10778000,13637792.310000002,112942937.31,{"$f":"'B4-FinPerf RE'!K35","v":112942937.31},{"$f":"'B4-FinPerf RE'!L35","v":108140816.27764998},{"$f":"'B4-FinPerf RE'!M35","v":114960532.39565724}]
["Loss on disposal of PPE",null,null,null,null,null,null,null,null,null,null,null,null,0,0,{"$f":"'B4-FinPerf RE'!K36","v":0},{"$f":"'B4-FinPerf RE'!L36","v":0},{"$f":"'B4-FinPerf RE'!M36","v":0}]
["Total Expenditure",null,{"$f":"SUM(C25:C35)","v":15296541},{"$f":"SUM(D25:D35)","v":20650683},22916938,19959737,12580402,49010000.469999999,24038354,15678018,25552000,23058200,25083000,21638943.592399999,275462817.06239998,275462817.06239998,281847566.27765,299821726.39565724]
[]
["Surplus/(Deficit)",null,{"$f":"C22-C36","v":89698462},-13610719,-16581399,-13035227,-1010149,37475326.530000001,-18184660,3170954,49523329,-4483592,-4770000,3026737.6376000047,111219063.16760004,111219063.16760004,106146014.72235,118727351.60434276]
["Transfers and subsidies - capital (monetary allocations) (National / Provincial and District)",null,16064251,7969703,4101013,1509177,1509177,10160728,789447,802000,5400000,6520000,5610000,{"$f":"P39-SUM(C39:M39)","v":2007504},null,{"$f":"'B4-FinPerf RE'!K40","v":62443000},{"$f":"'B4-FinPerf RE'!L40","v":68243000},{"$f":"'B4-FinPerf RE'!M40","v":73283000}]
["Transfers and subsidies - capital (monetary allocations) (National / Provincial Departmental Agencies, Households, Non-profit Institutions, Private Enterprises, Public Corporatons, Higher Educational Institutions)",null,0,0,0,0,0,0,0,0,0,0,0,{"$f":"P40-SUM(C40:M40)","v":0},null,{"$f":"'B4-FinPerf RE'!K41","v":0},{"$f":"'B4-FinPerf RE'!L41","v":0},{"$f":"'B4-FinPerf RE'!M41","v":0}]
["Transfers and subsidies - capital (in-kind - all) ",null,0,0,0,0,0,0,0,0,0,0,0,{"$f":"P41-SUM(C41:M41)","v":0},null,{"$f":"'B4-FinPerf RE'!K42","v":0},{"$f":"'B4-FinPerf RE'!L42","v":0},{"$f":"'B4-FinPerf RE'!M42","v":0}]
["Surplus/(Deficit) after capital transfers & contributions",null,{"$f":"C38+SUM(C39:C41)","v":105762713},{"$f":"D38+SUM(D39:D41)","v":-5641016},-12480386,-11526050,499028,47636054.530000001,-17395213,3972954,54923329,2036408,840000,5034241.6376000047,111219063.16760004,{"$f":"P38+SUM(P39:P41)","v":173662063.16760004},174389014.72235,192010351.60434276]
[{"$f":"head27a","v":"References"}]
["1. Surplus (Deficit) must reconcile with budget table A4 and monthly budget statement table C4"]
["check",null,null,null,null,null,null,null,null,null,null,null,null,null,null,{"$f":"P42-'B4-FinPerf RE'!K43","v":0},{"$f":"Q42-'B4-FinPerf RE'!L43","v":0},{"$f":"R42-'B4-FinPerf RE'!M43","v":0}]

{"sheet":"SB15","index":33,"n_rows":64,"n_cols":18,"rows_kept":64,"cut":false,"hidden":false,"merged":[[1,0,2,0],[1,15,1,17],[1,1,2,1],[1,2,1,13]]}
[{"$f":"muni&\" - \"&ADJB15&\" - \"&Date","v":"LIM332 Greater Letaba - Supporting Table SB15 Adjustments Budget - monthly cash flow - 27 February 2019"}]
["Monthly cash flows",{"$f":"head27","v":"Ref"},{"$f":"Head2","v":"Budget Year 2018/19"},null,null,null,null,null,null,null,null,null,null,null,null,{"$f":"Head3a","v":"Medium Term Revenue and Expenditure Framework"}]
[null,null,"July","August","Sept.","October","November","December","January","February","March","April","May","June","Full year budget",{"$f":"Head9","v":"Budget Year 2018/19"},{"$f":"Head10","v":"Budget Year +1 2019/20"},{"$f":"Head11","v":"Budget Year +2 2020/21"}]
["R thousands",null,{"$f":"Head5A","v":"Outcome"},"Outcome","Outcome","Outcome","Outcome","Outcome",{"$f":"Head7","v":"Adjusted Budget"},"Adjusted Budget","Adjusted Budget","Adjusted Budget","Adjusted Budget","Adjusted Budget",null,{"$f":"Head7","v":"Adjusted Budget"},{"$f":"Head7","v":"Adjusted Budget"},{"$f":"Head7","v":"Adjusted Budget"}]
["Cash Receipts By Source",1]
["Property rates",null,340301,145894,247296,253776,234981,119758,875608,1393897,1985000,1993608,1523000,{"$f":"P6-SUM(C6:M6)","v":1004852.9419999998},{"$f":"SUM(C6:N6)","v":10117971.942},{"$f":"16863286.57*0.6","v":10117971.942},{"$f":"16894401*0.6","v":10136640.6},{"$f":"17992537*0.6","v":10795522.199999999}]
["Service charges - electricity revenue",null,{"$f":"980865+2417","v":983282},{"$f":"751288+2313","v":753601},{"$f":"617206+2157","v":619363},{"$f":"821378+2470","v":823848},{"$f":"268544+312151","v":580695},{"$f":"625868+658534","v":1284402},1647513,1650000,2290653,2897000,3254000,2788957.568,19573314.568,{"$f":"24466643.21*0.8","v":19573314.568},{"$f":"23926975*0.8","v":19141580},{"$f":"25482229*0.8","v":20385783.200000003}]
["Service charges - water revenue",null,0,0,0,0,0,0,0,0,0,0,0,0,0,0,0,0]
["Service charges - sanitation revenue",null,0,0,0,0,0,0,0,0,0,0,0,0,0,0,0,0]
["Service charges - refuse",null,101626,109070,74076,137964,147832,59980,434542,800000,852000,752000,775000,701948.09200000018,4946038.0920000002,{"$f":"8243396.82*0.6","v":4946038.0920000002},{"$f":"7714218*0.6","v":4628530.8},{"$f":"8215642*0.6","v":4929385.2}]
["Service charges - other",null,0,0,0,0,0,0,0,0,0,0,0,0,0,0,0,0]
["Rental of facilities and equipment",null,3316,5429,883,0,15246,4043,4528,234500,188000,124000,105000,271852.77,956797.77,956797.77,1018989,1085223]
["Interest earned - external investments",null,62736,62709,62253,63495,61562,54437,54816,56700,165000,145000,125000,1798001.264,2711709.264,{"$f":"4519515.44*0.6","v":2711709.264},{"$f":"4813283*0.6","v":2887969.8},{"$f":"5126147*0.6","v":3075688.1999999997}]
["Interest earned - outstanding debtors",null,1024763,1036239,1052880,0,1806676,1330280,1330280,1950000,1806676,1536000,1425000,1083328.216,15382122.216,{"$f":"19227652.77*0.8","v":15382122.216},{"$f":"18347450*0.8","v":14677960},{"$f":"19540035*0.8","v":15632028}]
["Dividends received",null,0,0,0,0,0,0,0,0,0,0,0,0,0,0,0,0]
["Fines, penalties and forfeits",null,9100,6275,3534,0,3546,6200,4200,99875,111000,140000,180000,156270,720000,{"$f":"1200000*0.6","v":720000},{"$f":"1278000*0.6","v":766800},{"$f":"1361070*0.6","v":816642}]
["Licences and permits",null,1281356,1355115,1189501,1177999,1631888,1064869,1293000,1287000,1300000,1520000,1278000,1500775.2479999997,15879503.248,{"$f":"22685004.64*0.7","v":15879503.248},{"$f":"24159530*0.7","v":16911671},{"$f":"25729899*0.7","v":18010929.299999997}]
["Agency services",null,0,394478,0,0,0,0,0,456000,321000,221000,395000,388536.33000000007,2176014.33,2176014.33,2317455,2468089]
["Transfer receipts - operational",null,100531000,2526000,0,2000000,0,81210000,0,3700000,{"$f":"62091000-3700000","v":58391000},0,0,0,248358000,248358000,274109000,297262000]
["Other revenue",null,706908,282240,126110,64833,59671,215433,{"$f":"485902+12436+310944","v":809282},5421000,6800000,7500000,8100000,7323091.6799999997,37408568.68,37408568.68,12799775,13631760]
["Cash Receipts by Source",null,{"$f":"SUM(C6:C20)","v":105044388},6677050,3375896,4521915,4542097,85349402,6453769,17048972,74210329,16828608,17160000,17017614.109999999,358230040.11000001,358230040.11000001,359396371.19999999,388093050.10000002]
[]
["Other Cash Flows by Source"]
["Transfers receipts - capital",null,35556000,0,0,0,1975000,10741000,0,3700000,10471000,0,0,{"$f":"P24-SUM(C24:M24)","v":0},{"$f":"SUM(C24:N24)","v":62443000},62443000,70764900,73538344]
["Contributions & Contributed assets",null,null,null,null,null,null,null,null,null,null,null,null,0,{"$f":"SUM(C25:N25)","v":0}]
["Proceeds on disposal of PPE",null,null,null,null,null,null,null,null,null,null,null,null,0,{"$f":"SUM(C26:N26)","v":0}]
["Short term loans",null,null,null,null,null,null,null,null,null,null,null,null,0,{"$f":"SUM(C27:N27)","v":0}]
["Borrowing long term/refinancing",null,null,null,null,null,null,null,null,null,null,null,null,0]
["Increase (decrease) in consumer deposits",null,null,null,null,null,null,null,null,null,null,null,null,0]
["Decrease (Increase) in non-current debtors",null,null,null,null,null,null,null,null,null,null,null,null,0]
["Decrease (increase) other non-current receivables",null,null,null,null,null,null,null,null,null,null,null,null,0]
["Decrease (increase) in non-current investments",null,null,null,null,null,null,null,null,null,null,null,null,0]
["Total Cash Receipts by Source",null,{"$f":"SUM(C21:C32)","v":140600388},6677050,3375896,4521915,6517097,96090402,6453769,20748972,84681329,16828608,17160000,17017614.109999999,420673040.11000001,420673040.11000001,430161271.19999999,461631394.10000002]
[]
["Cash Payments by Type"]
["Employee related costs",null,7012242,7402217,7406896,7411710,7502874,7305283,{"$f":"8172227-68179-528975","v":7575073},7986000,8351000,8527200,8912000,{"$f":"P36-SUM(C36:M36)","v":9873797.25},{"$f":"SUM(C36:N36)","v":95266292.25},95266292.25,101544882,108008806]
["Remuneration of councillors",null,1731493,1817240,1750536,1702753,1504630,1504630,1817240,2100000,2100000,2100000,2100000,2653510,22882032,22882032,24369368,25953376]
["Finance charges",null,null,null,null,null,null,null,null,null,null,null,null,0,0,0,0,0]
["Bulk purchases - Electricity",null,1943765,1941629,2445230,1077018,1051644,1001826,925624,1077018,1250000,1347000,1495000,1540805,17096559,17096559,18207835,19391344]
["Bulk purchases - Water & Sewer",null,0,0,0,0,0,0,0,0,0,0,0,0,0,0,0,0]
["Other materials",null,0,0,0,0,0,0,0,0,0,0,0,0,0,0,0,0]
["Contracted services",null,777784,667912,2830276,2628462,735088,2037696,1411417,1540000,895000,1542000,1798000,2512530.5023999996,null,19376165.5024,20635616,21976931]
["Transfers and grants - other municipalities",null,0,0,0,0,0,0,0,0,0,0,0,0,{"$f":"SUM(C43:N43)","v":0},0,0,0]
["Transfers and grants - other",null,0,0,0,0,0,0,0,0,0,0,0,0,null,0,0,0]
["Other expenditure",null,3831257,8821685,8484000,8216812,2837810,21681599,{"$f":"10458000-200000","v":10258000},2975000,12956000,9542000,10778000,12540423.609999999,{"$f":"SUM(C45:N45)","v":112922586.61},{"$f":"112943586.61-21000","v":112922586.61},{"$f":"108141207-484000","v":107657207},114961207]
["Cash Payments by Type",null,{"$f":"SUM(C36:C45)","v":15296541},20650683,22916938,21036755,13632046,33531034,21987354,15678018,25552000,23058200,25083000,29121066.362399999,248167469.86000001,267543635.3624,272414908,290291664]
[]
["Other Cash Flows/Payments by Type"]
["Capital assets",null,16064251,7969703,4101013,1509177,10160728,789447,4369800,2875000,5100000,2302000,3890000,{"$f":"P49-SUM(C49:M49)","v":103642881},{"$f":"SUM(C49:N49)","v":162774000},{"$f":"62443000+99800000+531000","v":162774000},{"$f":"70764900+85372000","v":156136900},{"$f":"73538344+97518000","v":171056344}]
["Repayment of borrowing",null,0,0,0,0,0,0,0,0,0,0,0,{"$f":"P50-SUM(C50:M50)","v":0},{"$f":"SUM(C50:N50)","v":0},0,0,0]
["Other Cash Flows/Payments",null,0,0,0,0,0,0,0,0,0,0,0,{"$f":"P51-SUM(C51:M51)","v":0},{"$f":"SUM(C51:N51)","v":0},0,0,0]
["Total Cash Payments by Type",null,{"$f":"SUM(C46:C51)","v":31360792},28620386,27017951,22545932,23792774,34320481,26357154,18553018,30652000,25360200,28973000,132763947.3624,410941469.86000001,430317635.3624,428551808,461348008]
[]
["NET INCREASE/(DECREASE) IN CASH HELD",null,{"$f":"C33-C52","v":109239596},-21943336,-23642055,-18024017,-17275677,61769921,-19903385,2195954,54029329,-8531592,-11813000,-115746333.2524,9731570.25,-9644595.252399981,1609463.1999999881,283386.10000002384]
["Cash/cash equivalents at the month/year beginning:",null,13671000,{"$f":"C56","v":122910596},100967260,77325205,59301188,42025511,103795432,83892047,86088001,140117330,131585738,119772738,null,{"$f":"C55","v":13671000},{"$f":"P56","v":4026404.747600019},{"$f":"Q56","v":5635867.9476000071}]
["Cash/cash equivalents at the month/year end:",null,{"$f":"C54+C55","v":122910596},100967260,77325205,59301188,42025511,103795432,83892047,86088001,140117330,131585738,119772738,4026404.7476000041,null,{"$f":"P54+P55","v":4026404.747600019},{"$f":"Q54+Q55","v":5635867.9476000071},{"$f":"R54+R55","v":5919254.0476000309}]
["References"]
["1. Note that this section of Table SB15 is deliberately not linked to Table B4 because timing differences between the invoicing of clients and receiving the cash means that the cashflow will differ from budgeted revenue, and similarly for budgeted expenditure. "]
[]
[]
[]
[]
[null,null,null,null,null,{"$f":"F46+F62","v":21036755},13632046,33531034,21987354,15678018,25552000,23058200,25083000,29121066.362399999,248167469.86000001,267543635.3624,272414908,290291664]
[null,null,null,null,null,{"$f":"F54-F62","v":-18024017},-17275677,61769921,-19903385,2195954,54029329,-8531592,-11813000,-115746333.2524,9731570.25,-9644595.252399981,1609463.1999999881,283386.10000002384]

{"sheet":"SB16","index":34,"n_rows":45,"n_cols":18,"rows_kept":45,"cut":false,"hidden":false,"merged":[[1,0,2,0],[1,1,2,1]]}
[{"$f":"muni&\" - \"&ADJB16&\" - \"&Date","v":"LIM332 Greater Letaba - Supporting Table SB16 Adjustments Budget - monthly capital expenditure (municipal vote) - 27 February 2019"}]
[{"$f":"desc&\" - Municipal Vote\"","v":"Description - Municipal Vote"},{"$f":"head27","v":"Ref"},{"$f":"Head2","v":"Budget Year 2018/19"},null,null,null,null,null,null,null,null,null,null,null,null,"Medium Term Revenue and Expenditure Framework"]
[null,null,"July","August","Sept.","October","November","December","January","February","March","April","May","June","Full year budget",{"$f":"Head9","v":"Budget Year 2018/19"},{"$f":"Head10","v":"Budget Year +1 2019/20"},{"$f":"Head11","v":"Budget Year +2 2020/21"}]
["R thousands",null,{"$f":"Head5A","v":"Outcome"},"Outcome","Outcome","Outcome","Outcome","Outcome",{"$f":"Head7","v":"Adjusted Budget"},"Adjusted Budget","Adjusted Budget","Adjusted Budget","Adjusted Budget","Adjusted Budget",null,{"$f":"Head7","v":"Adjusted Budget"},{"$f":"Head7","v":"Adjusted Budget"},{"$f":"Head7","v":"Adjusted Budget"}]
["Multi-year expenditure appropriation",1]
[{"$f":"'B5-Capex'!A8","v":"Vote 1 - Executive & Council"},null,0,0,0,0,0,0,0,0,0,0,0,{"$f":"P6-SUM(C6:M6)","v":0},null,{"$f":"'B5-Capex'!K8","v":0},{"$f":"'B5-Capex'!L8","v":0},{"$f":"'B5-Capex'!M8","v":0}]
[{"$f":"'B5-Capex'!A9","v":"Vote 2 - Finance and Administration"},null,0,0,0,0,0,0,0,0,0,0,0,0,null,{"$f":"'B5-Capex'!K9","v":0},{"$f":"'B5-Capex'!L9","v":0},{"$f":"'B5-Capex'!M9","v":0}]
[{"$f":"'B5-Capex'!A10","v":"Vote 3 - Internal Audit"},null,0,0,0,0,0,0,0,0,0,0,0,0,null,{"$f":"'B5-Capex'!K10","v":0},{"$f":"'B5-Capex'!L10","v":0},{"$f":"'B5-Capex'!M10","v":0}]
[{"$f":"'B5-Capex'!A11","v":"Vote 4 - Community and Public Safety"},null,489087,0,629359,0,0,0,0,0,0,0,0,600000,null,{"$f":"'B5-Capex'!K11","v":1718446},{"$f":"'B5-Capex'!L11","v":3200000},{"$f":"'B5-Capex'!M11","v":7500000}]
[{"$f":"'B5-Capex'!A12","v":"Vote 5 - Sports and Recreation"},null,3443984,6629912,0,5721883,5721883,13943153,1201233,2578000,4568000,5931000,5000368,11931896,null,{"$f":"'B5-Capex'!K12","v":66671312},{"$f":"'B5-Capex'!L12","v":59635415},{"$f":"'B5-Capex'!M12","v":40832889}]
[{"$f":"'B5-Capex'!A13","v":"Vote 6 - Housing"},null,0,0,0,0,0,0,0,0,0,0,0,0,null,{"$f":"'B5-Capex'!K13","v":0},{"$f":"'B5-Capex'!L13","v":0},{"$f":"'B5-Capex'!M13","v":0}]
[{"$f":"'B5-Capex'!A14","v":"Vote 7 - Planning and development "},null,0,0,0,0,0,0,0,0,0,0,0,0,null,{"$f":"'B5-Capex'!K14","v":0},{"$f":"'B5-Capex'!L14","v":0},{"$f":"'B5-Capex'!M14","v":0}]
[{"$f":"'B5-Capex'!A15","v":"Vote 8 - Road Transport"},null,15375880,5923598,3177958,1889790,1889790,7707872,4892072.8100000024,0,null,null,null,0,null,{"$f":"'B5-Capex'!K15","v":40856960.810000002},{"$f":"'B5-Capex'!L15","v":50559811},{"$f":"'B5-Capex'!M15","v":88870950}]
[{"$f":"'B5-Capex'!A16","v":"Vote 9 - Energy Sources"},null,0,0,0,0,0,0,0,0,0,0,0,0,null,{"$f":"'B5-Capex'!K16","v":0},{"$f":"'B5-Capex'!L16","v":0},{"$f":"'B5-Capex'!M16","v":0}]
[{"$f":"'B5-Capex'!A17","v":"Vote 10 - Waste Water Management"},null,0,0,0,0,0,0,0,0,0,0,0,0,null,{"$f":"'B5-Capex'!K17","v":0},{"$f":"'B5-Capex'!L17","v":0},{"$f":"'B5-Capex'!M17","v":0}]
[{"$f":"'B5-Capex'!A18","v":"Vote 11 - Waste Management"},null,0,0,0,0,0,0,0,0,0,0,0,0,null,{"$f":"'B5-Capex'!K18","v":0},{"$f":"'B5-Capex'!L18","v":0},{"$f":"'B5-Capex'!M18","v":0}]
[{"$f":"'B5-Capex'!A19","v":"Vote 12 - [NAME OF VOTE 12]"},null,0,0,0,0,0,0,0,0,0,0,0,0,null,{"$f":"'B5-Capex'!K19","v":0},{"$f":"'B5-Capex'!L19","v":0},{"$f":"'B5-Capex'!M19","v":0}]
[{"$f":"'B5-Capex'!A20","v":"Vote 13 - [NAME OF VOTE 13]"},null,0,0,0,0,0,0,0,0,0,0,0,0,null,{"$f":"'B5-Capex'!K20","v":0},{"$f":"'B5-Capex'!L20","v":0},{"$f":"'B5-Capex'!M20","v":0}]
[{"$f":"'B5-Capex'!A21","v":"Vote 14 - [NAME OF VOTE 14]"},null,0,0,0,0,0,0,0,0,0,0,0,0,null,{"$f":"'B5-Capex'!K21","v":0},{"$f":"'B5-Capex'!L21","v":0},{"$f":"'B5-Capex'!M21","v":0}]
[{"$f":"'B5-Capex'!A22","v":"Vote 15 - [NAME OF VOTE 15]"},null,0,0,0,0,0,0,0,0,0,0,0,0,null,{"$f":"'B5-Capex'!K22","v":0},{"$f":"'B5-Capex'!L22","v":0},{"$f":"'B5-Capex'!M22","v":0}]
["Capital Multi-year expenditure sub-total",3,{"$f":"SUM(C6:C20)","v":19308951},12553510,3807317,7611673,7611673,21651025,6093305.8100000024,2578000,4568000,5931000,5000368,12531896,0,109246718.81,113395226,137203839]
[null,null,null,null,null,null,null,null,null,null,null,null,null,{"$f":"SUM(N7:N21)","v":25063792},{"$f":"SUM(O7:O21)","v":0},{"$f":"SUM(P7:P21)","v":218493437.62},{"$f":"SUM(Q7:Q21)","v":226790452},{"$f":"SUM(R7:R21)","v":274407678}]
["Single-year expenditure appropriation"]
[{"$f":"A6","v":"Vote 1 - Executive & Council"},null,0,0,0,0,0,0,0,0,0,0,0,{"$f":"P24-SUM(C24:M24)","v":0},null,{"$f":"'B5-Capex'!K26","v":0},{"$f":"'B5-Capex'!L26","v":0},{"$f":"'B5-Capex'!M26","v":0}]
["Vote 2 - Finance and Administration",null,0,0,3015998,411751,411751,0,36542,0,0,2543623,0,0,null,{"$f":"'B5-Capex'!K27","v":6419665},{"$f":"'B5-Capex'!L27","v":2030000},{"$f":"'B5-Capex'!M27","v":0}]
["Vote 3 - Internal Audit",null,0,0,0,0,0,0,0,0,0,0,0,0,null,{"$f":"'B5-Capex'!K28","v":0},{"$f":"'B5-Capex'!L28","v":0},{"$f":"'B5-Capex'!M28","v":0}]
["Vote 4 - Community and Public Safety",null,0,0,0,0,0,0,0,0,0,400000,0,0,null,{"$f":"'B5-Capex'!K29","v":400000},{"$f":"'B5-Capex'!L29","v":0},{"$f":"'B5-Capex'!M29","v":0}]
["Vote 5 - Sports and Recreation",null,0,0,0,0,0,0,0,0,0,0,0,0,null,{"$f":"'B5-Capex'!K30","v":0},{"$f":"'B5-Capex'!L30","v":0},{"$f":"'B5-Capex'!M30","v":0}]
["Vote 6 - Housing",null,0,0,0,0,0,0,0,0,0,0,0,0,null,{"$f":"'B5-Capex'!K31","v":0},{"$f":"'B5-Capex'!L31","v":0},{"$f":"'B5-Capex'!M31","v":0}]
["Vote 7 - Planning and development ",null,0,0,0,0,0,0,0,0,0,0,0,0,null,{"$f":"'B5-Capex'!K32","v":0},{"$f":"'B5-Capex'!L32","v":0},{"$f":"'B5-Capex'!M32","v":0}]
["Vote 8 - Road Transport",null,0,1999853,{"$f":"1377966+763000","v":2140966},0,0,2230496,1414000,4560000,3410000,2750685.2600000016,0,1023000,null,{"$f":"'B5-Capex'!K33","v":19529000.260000002},{"$f":"'B5-Capex'!L33","v":11615000},{"$f":"'B5-Capex'!M33","v":2342092}]
["Vote 9 - Energy Sources",null,0,1490145,2348235,0,0,0,436929,8520000,5120000,4600000,0,3946058.6000000015,null,{"$f":"'B5-Capex'!K34","v":26461367.600000001},{"$f":"'B5-Capex'!L34","v":24635000},{"$f":"'B5-Capex'!M34","v":35169000}]
["Vote 10 - Waste Water Management",null,0,0,0,0,0,0,0,0,1500000,3452000,1512654.4500000002,0,null,{"$f":"'B5-Capex'!K35","v":6464654.4500000002},{"$f":"'B5-Capex'!L35","v":19013657},{"$f":"'B5-Capex'!M35","v":17294945}]
["Vote 11 - Waste Management",null,0,0,102775,0,0,0,0,458000,573000,1001000,2500000,505225,null,{"$f":"'B5-Capex'!K36","v":5140000},{"$f":"'B5-Capex'!L36","v":3700000},{"$f":"'B5-Capex'!M36","v":0}]
["Vote 12 - [NAME OF VOTE 12]",null,0,0,0,0,0,0,0,0,0,0,0,0,null,{"$f":"'B5-Capex'!K37","v":0},{"$f":"'B5-Capex'!L37","v":0},{"$f":"'B5-Capex'!M37","v":0}]
["Vote 13 - [NAME OF VOTE 13]",null,0,0,0,0,0,0,0,0,0,0,0,0,null,{"$f":"'B5-Capex'!K38","v":0},{"$f":"'B5-Capex'!L38","v":0},{"$f":"'B5-Capex'!M38","v":0}]
["Vote 14 - [NAME OF VOTE 14]",null,0,0,0,0,0,0,0,0,0,0,0,0,null,{"$f":"'B5-Capex'!K39","v":0},{"$f":"'B5-Capex'!L39","v":0},{"$f":"'B5-Capex'!M39","v":0}]
["Vote 15 - [NAME OF VOTE 15]",null,0,0,0,0,0,0,0,0,0,0,0,0,null,{"$f":"'B5-Capex'!K40","v":0},{"$f":"'B5-Capex'!L40","v":0},{"$f":"'B5-Capex'!M40","v":0}]
["Capital single-year expenditure sub-total",3,{"$f":"SUM(C24:C38)","v":0},{"$f":"SUM(D24:D38)","v":3489998},7607974,411751,411751,2230496,1887471,13538000,10603000,14747308.260000002,4012654.45,5474283.6000000015,0,64414687.310000002,60993657,54806037]
["Total Capital Expenditure",2,{"$f":"C21+C39","v":19308951},{"$f":"D21+D39","v":16043508},11415291,8023424,8023424,23881521,7980776.8100000024,16116000,15171000,20678308.260000002,9013022.4499999993,18006179.600000001,0,173661406.12,174388883,192009876]
[{"$f":"head27a","v":"References"}]
["1. Table should be completed as either Multi-Year expenditure appropriation or Budget Year and Forward Year estimates"]
["2. Total Capital Expenditure must reconcile to budget table A5 and monthly budget statement table C5"]
[]
["check",null,null,null,null,null,null,null,null,null,null,null,null,null,{"$f":"O40-'B5-Capex'!J42","v":5615913},{"$f":"P40-'B5-Capex'!K42","v":0},{"$f":"Q40-'B5-Capex'!L42","v":0},{"$f":"R40-'B5-Capex'!M42","v":0}]

{"sheet":"SB17","index":35,"n_rows":31,"n_cols":17,"rows_kept":31,"cut":false,"hidden":false,"merged":[[1,0,2,0],[1,1,2,1],[1,2,1,13]]}
[{"$f":"muni&\" - \"&ADJB17&\" - \"&Date","v":"LIM332 Greater Letaba - Supporting Table SB17 Adjustments Budget - monthly capital expenditure (functional classification) - 27 February 2019"}]
[{"$f":"desc","v":"Description"},{"$f":"head27","v":"Ref"},{"$f":"Head2","v":"Budget Year 2018/19"},null,null,null,null,null,null,null,null,null,null,null,{"$f":"Head3a","v":"Medium Term Revenue and Expenditure Framework"}]
[null,null,"July","August","Sept.","October","November","December","January","February","March","April","May","June",{"$f":"Head9","v":"Budget Year 2018/19"},{"$f":"Head10","v":"Budget Year +1 2019/20"},{"$f":"Head11","v":"Budget Year +2 2020/21"}]
["R thousands",null,{"$f":"Head5A","v":"Outcome"},"Outcome","Outcome","Outcome","Outcome","Outcome",{"$f":"Head7","v":"Adjusted Budget"},"Adjusted Budget","Adjusted Budget","Adjusted Budget","Adjusted Budget","Adjusted Budget","Adjusted Budget","Adjusted Budget","Adjusted Budget"]
["Capital Expenditure - Functional"]
[{"$f":"'B2-FinPerf SC'!A7","v":"Governance and administration"},null,{"$f":"SUM(C7:C9)","v":0},0,3015998,411751,411751,15916,36542,600000,547800,579907,800000,{"$f":"O6-SUM(C6:M6)","v":0},{"$f":"'B5-Capex'!K45","v":6419665},{"$f":"'B5-Capex'!L45","v":2030000},{"$f":"'B5-Capex'!M45","v":0}]
[{"$f":"'B2-FinPerf SC'!A8","v":"Executive and council"},null,0,0,0,0,0,0,0,0,0,0,0,0,{"$f":"'B5-Capex'!K46","v":0},{"$f":"'B5-Capex'!L46","v":0},{"$f":"'B5-Capex'!M46","v":0}]
[{"$f":"'B2-FinPerf SC'!A9","v":"Finance and administration"},null,0,0,3015998,411751,411751,15916,36542,600000,547800,579907,800000,0,{"$f":"'B5-Capex'!K47","v":6419665},{"$f":"'B5-Capex'!L47","v":2030000},{"$f":"'B5-Capex'!M47","v":0}]
[{"$f":"'B2-FinPerf SC'!A10","v":"Internal audit"},null,0,0,0,0,0,0,0,0,0,0,0,0,{"$f":"'B5-Capex'!K48","v":0},{"$f":"'B5-Capex'!L48","v":0},{"$f":"'B5-Capex'!M48","v":0}]
[{"$f":"'B2-FinPerf SC'!A11","v":"Community and public safety"},null,{"$f":"SUM(C11:C15)","v":3933071},6629912,1495125,5721883,5721883,13943153,3415556.799999997,3401643.4,0,0,0,0,{"$f":"'B5-Capex'!K49","v":44262227.199999996},{"$f":"'B5-Capex'!L49","v":76835415},{"$f":"'B5-Capex'!M49","v":71001889}]
[{"$f":"'B2-FinPerf SC'!A12","v":"Community and social services"},null,489087,0,1495125,0,0,0,0,134234.39999999991,0,0,0,0,{"$f":"'B5-Capex'!K50","v":2118446.4},{"$f":"'B5-Capex'!L50","v":3200000},{"$f":"'B5-Capex'!M50","v":7500000}]
[{"$f":"'B2-FinPerf SC'!A13","v":"Sport and recreation"},null,3443984,6629912,0,5721883,5721883,13943153,1005556.799999997,0,0,0,0,0,{"$f":"'B5-Capex'!K51","v":36466371.799999997},{"$f":"'B5-Capex'!L51","v":59635415},{"$f":"'B5-Capex'!M51","v":40832889}]
[{"$f":"'B2-FinPerf SC'!A14","v":"Public safety"},null,0,0,0,0,0,0,2410000,3267409,0,0,0,0,{"$f":"'B5-Capex'!K52","v":5677409},{"$f":"'B5-Capex'!L52","v":14000000},{"$f":"'B5-Capex'!M52","v":22669000}]
[{"$f":"'B2-FinPerf SC'!A15","v":"Housing"},null,0,0,0,0,0,0,0,0,0,0,0,0,{"$f":"'B5-Capex'!K53","v":0},{"$f":"'B5-Capex'!L53","v":0},{"$f":"'B5-Capex'!M53","v":0}]
[{"$f":"'B2-FinPerf SC'!A16","v":"Health"},null,0,0,0,0,0,0,0,0,0,0,0,0,{"$f":"'B5-Capex'!K54","v":0},{"$f":"'B5-Capex'!L54","v":0},{"$f":"'B5-Capex'!M54","v":0}]
[{"$f":"'B2-FinPerf SC'!A17","v":"Economic and environmental services"},null,{"$f":"SUM(C17:C19)","v":15375880},7923451,4555924,1889790,1889790,7707872,4092238,4589000,8594000,14587000,9711000,9674956.6100000143,{"$f":"'B5-Capex'!K55","v":90590901.610000014},{"$f":"'B5-Capex'!L55","v":62174811},{"$f":"'B5-Capex'!M55","v":91213042}]
[{"$f":"'B2-FinPerf SC'!A18","v":"Planning and development"},null,0,0,0,0,0,0,0,0,0,0,0,0,{"$f":"'B5-Capex'!K56","v":0},{"$f":"'B5-Capex'!L56","v":0},{"$f":"'B5-Capex'!M56","v":0}]
[{"$f":"'B2-FinPerf SC'!A19","v":"Road transport"},null,15375880,7923451,4555924,1889790,1889790,7707872,{"$f":"6280238-2188000","v":4092238},4589000,8594000,14587000,9711000,9674956.6100000143,{"$f":"'B5-Capex'!K57","v":90590901.610000014},{"$f":"'B5-Capex'!L57","v":62174811},{"$f":"'B5-Capex'!M57","v":91213042}]
[{"$f":"'B2-FinPerf SC'!A20","v":"Environmental protection"},null,0,0,0,0,0,0,0,0,0,0,0,0,{"$f":"'B5-Capex'!K58","v":0},{"$f":"'B5-Capex'!L58","v":0},{"$f":"'B5-Capex'!M58","v":0}]
[{"$f":"'B2-FinPerf SC'!A21","v":"Trading services"},null,{"$f":"SUM(C21:C24)","v":0},{"$f":"SUM(D21:D24)","v":1490145},2348235,0,0,2214579,436929,0,5423000,14232000,6243878.0500000017,0,{"$f":"'B5-Capex'!K59","v":32388766.050000001},{"$f":"'B5-Capex'!L59","v":33348657},{"$f":"'B5-Capex'!M59","v":29794945}]
[{"$f":"'B2-FinPerf SC'!A22","v":"Energy sources"},null,0,1490145,2348235,0,0,2214579,436929,0,5423000,6412000,2459223.6000000015,0,{"$f":"'B5-Capex'!K60","v":20784111.600000001},{"$f":"'B5-Capex'!L60","v":10635000},{"$f":"'B5-Capex'!M60","v":12500000}]
[{"$f":"'B2-FinPerf SC'!A23","v":"Water management"},null,0,0,0,0,0,0,0,0,0,0,0,0,{"$f":"'B5-Capex'!K61","v":0},{"$f":"'B5-Capex'!L61","v":0},{"$f":"'B5-Capex'!M61","v":0}]
[{"$f":"'B2-FinPerf SC'!A24","v":"Waste water management"},null,0,0,0,0,0,0,0,0,0,4250000,2214654.4500000002,0,{"$f":"'B5-Capex'!K62","v":6464654.4500000002},{"$f":"'B5-Capex'!L62","v":19013657},{"$f":"'B5-Capex'!M62","v":17294945}]
[{"$f":"'B2-FinPerf SC'!A25","v":"Waste management"},null,0,0,0,0,0,0,0,0,0,3570000,1570000,0,{"$f":"'B5-Capex'!K63","v":5140000},{"$f":"'B5-Capex'!L63","v":3700000},{"$f":"'B5-Capex'!M63","v":0}]
[{"$f":"'B2-FinPerf SC'!A26","v":"Other"},null,0,0,0,0,0,0,0,0,0,0,0,0,{"$f":"'B5-Capex'!K64","v":0},{"$f":"'B5-Capex'!L64","v":0},{"$f":"'B5-Capex'!M64","v":0}]
["Total Capital Expenditure - Functional",null,{"$f":"C6+C10+C16+C20+C25","v":19308951},{"$f":"D6+D10+D16+D20+D25","v":16043508},11415282,8023424,8023424,23881520,7981265.799999997,8590643.4000000004,14564800,29398907,16754878.050000001,9674956.6100000143,{"$f":"O6+O10+O16+O20+O25","v":173661559.86000001},{"$f":"P6+P10+P16+P20+P25","v":174388883},{"$f":"Q6+Q10+Q16+Q20+Q25","v":192009876}]
[{"$f":"head27a","v":"References"}]
["1. Table should be completed as either Multi-Year expenditure appropriation or Budget Year and Forward Year estimates"]
["2. Total Capital Expenditure must reconcile to the 'Financial Position' budget and monthly budget statement"]
[]
["check",null,null,null,null,null,null,null,null,null,null,null,null,null,{"$f":"O26-'B5-Capex'!K65","v":0},{"$f":"P26-'B5-Capex'!L65","v":0},{"$f":"Q26-'B5-Capex'!M65","v":0}]

{"sheet":"SB18a","index":36,"n_rows":183,"n_cols":13,"rows_kept":183,"cut":false,"hidden":false,"merged":[[1,0,3,0],[177,0,177,12],[179,0,179,12],[172,0,172,12],[173,0,173,9],[174,0,174,9],[175,0,175,12],[1,2,1,10],[1,1,3,1]]}
[{"$f":"muni&\" - \"&ADJB18a&\" - \"&Date","v":"LIM332 Greater Letaba - Supporting Table SB18a Adjustments Budget - capital expenditure on new assets by asset class - 27 February 2019"}]
[{"$f":"desc","v":"Description"},{"$f":"head27","v":"Ref"},{"$f":"Head2","v":"Budget Year 2018/19"},null,null,null,null,null,null,null,null,{"$f":"Head10","v":"Budget Year +1 2019/20"},{"$f":"Head11","v":"Budget Year +2 2020/21"}]
[null,null,{"$f":"Head6","v":"Original Budget"},{"$f":"Head54","v":"Prior Adjusted"},{"$f":"Head51","v":"Accum. Funds"},{"$f":"Head52","v":"Multi-year capital"},{"$f":"Head53","v":"Unfore. Unavoid."},{"$f":"Head55","v":"Nat. or Prov. Govt"},{"$f":"Head50","v":"Other Adjusts."},{"$f":"Head56","v":"Total Adjusts."},{"$f":"Head7","v":"Adjusted Budget"},{"$f":"Head7","v":"Adjusted Budget"},{"$f":"Head7","v":"Adjusted Budget"}]
[null,null,null,7,8,9,10,11,12,13,14]
["R thousands",null,"A","A1","B","C","D","E","F","G","H"]
["Capital expenditure on new assets by Asset Class/Sub-class"]
[]
["Infrastructure",null,{"$f":"C9+C14+C18+C28+C39+C46+C54+C64+C70","v":88028718.260000005},{"$f":"D9+D14+D18+D28+D39+D46+D54+D64+D70","v":0},0,0,0,0,-8262343,{"$f":"SUM(E8:I8)","v":-8262343},{"$f":"IF(D8=0,C8+J8,D8+J8)","v":79766375.260000005},{"$f":"L9+L14+L18+L28+L39+L46+L54+L64+L70","v":105598468},{"$f":"M9+M14+M18+M28+M39+M46+M54+M64+M70","v":141334895}]
["Roads Infrastructure",null,{"$f":"SUM(C10:C13)","v":65206303.810000002},{"$f":"SUM(D10:D13)","v":0},0,0,0,0,-13212343,{"$f":"SUM(E9:I9)","v":-13212343},{"$f":"IF(D9=0,C9+J9,D9+J9)","v":51993960.810000002},59059811,88870950]
["Roads",null,{"$f":"1000000+500000+2500000+1700000+1200000+800000+500000+800000+6000000+400000+600000+600000+7000000+5283210+7450000+4987800+5503600+5401000+1948852.39+39005.98+2078851.78+169575.27+3584408.39+2823000+2823000-486000","v":65206303.810000002},null,null,null,null,null,-13212343,-13212343,51993960.810000002,{"$f":"48800000+10259811","v":59059811},{"$f":"71262930+16408020+600000+600000","v":88870950}]
["Road Structures",null,null,null,null,null,null,null,null,0,0]
["Road Furniture",null,null,null,null,null,null,null,null,0,0]
["Capital Spares",null,null,null,null,null,null,null,null,0,0]
["Storm water Infrastructure",null,{"$f":"SUM(C15:C17)","v":5664654.4500000002},0,0,0,0,0,0,0,5664654.4500000002,{"$f":"SUM(L15:L17)","v":19013657},{"$f":"SUM(M15:M17)","v":17294945}]
["Drainage Collection",null,null,null,null,null,null,null,null,0,0]
["Storm water Conveyance",null,{"$f":"1900000+3764654.45","v":5664654.4500000002},null,null,null,null,null,0,0,5664654.4500000002,19013657,17294945]
["Attenuation",null,null,null,null,null,null,null,null,0,0]
["Electrical Infrastructure",null,{"$f":"SUM(C19:C27)","v":15457760},0,0,0,0,0,6650000,6650000,22107760,23825000,35169000]
["Power Plants",null,null,null,null,null,null,null,null,0,0]
["HV Substations",null,null,null,null,null,null,null,null,0,0]
["HV Switching Station",null,null,null,null,null,null,null,null,0,0]
["HV Transmission Conductors",null,null,null,null,null,null,null,null,0,0]
["MV Substations",null,null,null,null,null,null,null,null,0,0]
["MV Switching Stations",null,null,null,null,null,null,null,null,0,0]
["MV Networks",null,null,null,null,null,null,null,null,0,0]
["LV Networks",null,{"$f":"3800000+924760","v":4724760},null,null,null,null,null,0,0,4724760,0,0]
["Capital Spares",null,{"$f":"3000000+1400000+200000+150000+5983000","v":10733000},null,null,null,null,null,6650000,6650000,17383000,{"$f":"10635000+14000000-810000","v":23825000},{"$f":"12500000+22669000","v":35169000}]
["Water Supply Infrastructure",null,{"$f":"SUM(C29:C38)","v":0},0,0,0,0,0,0,0,0,0,0]
["Dams and Weirs",null,null,null,null,null,null,null,null,0,0]
["Boreholes",null,null,null,null,null,null,null,null,0,0]
["Reservoirs",null,null,null,null,null,null,null,null,0,0]
["Pump Stations",null,null,null,null,null,null,null,null,0,0]
["Water Treatment Works",null,null,null,null,null,null,null,null,0,0]
["Bulk Mains",null,null,null,null,null,null,null,null,0,0]
["Distribution",null,null,null,null,null,null,null,null,0,0]
["Distribution Points",null,null,null,null,null,null,null,null,0,0]
["PRV Stations",null,null,null,null,null,null,null,null,0,0]
["Capital Spares",null,null,null,null,null,null,null,null,0,0]
["Sanitation Infrastructure",null,{"$f":"SUM(C40:C45)","v":0},0,0,0,0,0,0,0,0,0,0]
["Pump Station",null,null,null,null,null,null,null,null,0,0]
["Reticulation",null,null,null,null,null,null,null,null,0,0]
["Waste Water Treatment Works",null,null,null,null,null,null,null,null,0,0]
["Outfall Sewers",null,null,null,null,null,null,null,null,0,0]
["Toilet Facilities",null,null,null,null,null,null,null,null,0,0]
["Capital Spares",null,null,null,null,null,null,null,null,0,0]
["Solid Waste Infrastructure",null,{"$f":"SUM(C47:C53)","v":1700000},0,0,0,0,0,-1700000,-1700000,0,3700000,0]
["Landfill Sites",null,1700000,null,null,null,null,null,-1700000,-1700000,0,3700000,0]
["Waste Transfer Stations",null,null,null,null,null,null,null,null,0,0]
["Waste Processing Facilities",null,null,null,null,null,null,null,null,0,0]
["Waste Drop-off Points",null,null,null,null,null,null,null,null,0,0]
["Waste Separation Facilities",null,null,null,null,null,null,null,null,0,0]
["Electricity Generation Facilities",null,null,null,null,null,null,null,null,0,0]
["Capital Spares",null,null,null,null,null,null,null,null,0,0]
["Rail Infrastructure",null,{"$f":"SUM(C55:C63)","v":0},0,0,0,0,0,0,0,0,0,0]
["Rail Lines",null,null,null,null,null,null,null,null,0,0]
["Rail Structures",null,null,null,null,null,null,null,null,0,0]
["Rail Furniture",null,null,null,null,null,null,null,null,0,0]
["Drainage Collection",null,null,null,null,null,null,null,null,0,0]
["Storm water Conveyance",null,null,null,null,null,null,null,null,0,0]
["Attenuation",null,null,null,null,null,null,null,null,0,0]
["MV Substations",null,null,null,null,null,null,null,null,0,0]
["LV Networks",null,null,null,null,null,null,null,null,0,0]
["Capital Spares",null,null,null,null,null,null,null,null,0,0]
["Coastal Infrastructure",null,{"$f":"SUM(C65:C69)","v":0},0,0,0,0,0,0,0,0,0,0]
["Sand Pumps",null,null,null,null,null,null,null,null,0,0]
["Piers",null,null,null,null,null,null,null,null,0,0]
["Revetments",null,null,null,null,null,null,null,null,0,0]
["Promenades",null,null,null,null,null,null,null,null,0,0]
["Capital Spares",null,null,null,null,null,null,null,null,0,0]
["Information and Communication Infrastructure",null,{"$f":"SUM(C71:C74)","v":0},0,0,0,0,0,0,0,0,0,0]
["Data Centres",null,null,null,null,null,null,null,null,0,0]
["Core Layers",null,null,null,null,null,null,null,null,0,0]
["Distribution Layers",null,null,null,null,null,null,null,null,{"$f":"SUM(E73:I73)","v":0},{"$f":"IF(D73=0,C73+J73,D73+J73)","v":0}]
["Capital Spares",null,null,null,null,null,null,null,null,0,0]
[]
["Community Assets",null,{"$f":"+C77+C100","v":40840432.199999996},{"$f":"+D77+D100","v":0},{"$f":"+E77+E100","v":0},0,0,0,639900,639900,41480332.199999996,63635415,48332889]
["Community Facilities",null,{"$f":"SUM(C78:C99)","v":4418446.4000000004},{"$f":"SUM(D78:D99)","v":0},{"$f":"SUM(E78:E99)","v":0},0,0,0,-2300000,-2300000,2118446.4000000004,4000000,7500000]
["Halls",null,{"$f":"600000+600000+400000","v":1600000},null,null,null,null,null,-1000000,-1000000,600000,2400000,4500000]
["Centres",null,null,null,null,null,null,null,null,0,0]
["Crèches",null,null,null,null,null,null,null,null,0,0]
["Clinics/Care Centres",null,null,null,null,null,null,null,null,0,0]
["Fire/Ambulance Stations",null,null,null,null,null,null,null,null,0,0]
["Testing Stations",null,null,null,null,null,null,null,null,0,0]
["Museums",null,null,null,null,null,null,null,null,0,0]
["Galleries",null,null,null,null,null,null,null,null,0,0]
["Theatres",null,null,null,null,null,null,null,null,0,0]
["Libraries",null,{"$f":"1118446.4+500000","v":1618446.4},null,null,null,null,null,-500000,-500000,1118446.3999999999,800000,3000000]
["Cemeteries/Crematoria",null,400000,null,null,null,null,null,null,0,400000,0,0]
["Police",null,null,null,null,null,null,null,null,0,0]
["Purls",null,null,null,null,null,null,null,null,0,0]
["Public Open Space",null,null,null,null,null,null,null,null,0,0]
["Nature Reserves",null,null,null,null,null,null,null,null,0,0]
["Public Ablution Facilities",null,null,null,null,null,null,null,null,0,0]
["Markets",null,null,null,null,null,null,null,null,0,0]
["Stalls",null,0,null,null,null,null,null,null,0,0]
["Abattoirs",null,null,null,null,null,null,null,null,0,0]
["Airports",null,null,null,null,null,null,null,null,0,0]
["Taxi Ranks/Bus Terminals",null,800000,null,null,null,null,null,-800000,-800000,0,800000,0]
["Capital Spares",null,0,null,null,null,null,null,null,0,0]
["Sport and Recreation Facilities",null,{"$f":"SUM(C101:C103)","v":36421985.799999997},{"$f":"SUM(D101:D103)","v":0},0,0,0,0,2939900,2939900,39361885.799999997,59635415,40832889]
["Indoor Facilities",null,0,null,null,null,null,null,0,0,0,0,0]
["Outdoor Facilities",null,{"$f":"13050771.18+11884802.62+300000+5593206+5593206","v":36421985.799999997},null,null,null,null,null,{"$f":"3165815-225915","v":2939900},2939900,39361885.799999997,{"$f":"15402226+18000000+18000000+8233189","v":59635415},{"$f":"20181858+20651031","v":40832889}]
["Capital Spares",null,0,null,null,null,null,null,0,0,0,0,0]
[]
["Heritage assets",null,{"$f":"SUM(C106:C110)","v":0},0,0,0,0,0,0,0,0,0,0]
["Monuments",null,null,null,null,null,null,null,null,0,0]
["Historic Buildings",null,null,null,null,null,null,null,null,0,0]
["Works of Art",null,null,null,null,null,null,null,null,0,0]
["Conservation Areas",null,null,null,null,null,null,null,null,0,0]
["Other Heritage",null,null,null,null,null,null,null,null,0,0]
[]
["Investment properties",null,{"$f":"+C113+C116","v":0},0,0,0,0,0,0,0,0,{"$f":"+L113+L116","v":0},{"$f":"+M113+M116","v":0}]
["Revenue Generating",null,{"$f":"SUM(C114:C115)","v":0},{"$f":"SUM(D114:D115)","v":0},{"$f":"SUM(E114:E115)","v":0},0,0,0,0,0,0,0,0]
["Improved Property",null,null,null,null,null,null,null,null,0,0]
["Unimproved Property",null,null,null,null,null,null,null,null,0,0]
["Non-revenue Generating",null,{"$f":"SUM(C117:C118)","v":0},{"$f":"SUM(D117:D118)","v":0},{"$f":"SUM(E117:E118)","v":0},0,0,0,0,0,0,0,0]
["Improved Property",null,null,null,null,null,null,null,null,0,0]
["Unimproved Property",null,null,null,null,null,null,null,null,0,0]
[]
["Other assets",null,{"$f":"+C121+C133","v":9383657.8599999994},{"$f":"+D121+D133","v":0},0,0,0,0,-800000,-800000,8583657.8599999994,{"$f":"+L121+L133","v":3955000},{"$f":"+M121+M133","v":2342092}]
["Operational Buildings",null,{"$f":"SUM(C122:C132)","v":9383657.8599999994},{"$f":"SUM(D122:D132)","v":0},0,0,0,0,-800000,-800000,8583657.8599999994,{"$f":"SUM(L122:L132)","v":3955000},{"$f":"SUM(M122:M132)","v":2342092}]
["Municipal Offices",null,{"$f":"100000+1000000+800000+20000+200000+600000+700000","v":3420000},null,null,null,null,null,-800000,-800000,2620000,800000,0]
["Pay/Enquiry Points",null,null,null,null,null,null,null,null,0,0]
["Building Plan Offices",null,null,null,null,null,null,null,null,0,0]
["Workshops",null,null,null,null,null,null,null,null,0,0]
["Yards",null,0,null,null,null,null,null,null,0,0]
["Stores",null,null,null,null,null,null,null,null,0,0]
["Laboratories",null,null,null,null,null,null,null,null,0,0]
["Training Centres",null,null,null,null,null,null,null,null,0,0]
["Manufacturing Plant",null,null,null,null,null,null,null,null,0,0]
["Depots",null,null,null,null,null,null,null,null,0,0]
["Capital Spares",null,{"$f":"50000+30000+50000+500000+50000+400000+16000+15000+50000+1440000+200000+980306.26+300000+150000+50000+6000+500000+1176351.6","v":5963657.8599999994},null,null,null,null,null,0,0,5963657.8599999994,3155000,2342092]
["Housing",null,{"$f":"SUM(C134:C136)","v":0},{"$f":"SUM(D134:D136)","v":0},{"$f":"SUM(E134:E136)","v":0},0,0,0,0,0,0,0,0]
["Staff Housing",null,null,null,null,null,null,null,null,0,0]
["Social Housing",null,null,null,null,null,null,null,null,0,0]
["Capital Spares",null,null,null,null,null,null,null,null,0,0]
[]
["Biological or Cultivated Assets",null,{"$f":"SUM(C139:C139)","v":0},0,0,0,0,0,0,{"$f":"SUM(E138:I138)","v":0},{"$f":"IF(D138=0,C138+J138,D138+J138)","v":0},0,0]
["Biological or Cultivated Assets",null,null,null,null,null,null,null,null,0,0]
[]
["Intangible Assets",null,{"$f":"SUM(C142:C143)","v":1050000},{"$f":"SUM(D142:D143)","v":0},0,0,0,0,0,0,1050000,{"$f":"SUM(L142:L143)","v":0},{"$f":"SUM(M142:M143)","v":0}]
["Servitudes",null,null,null,null,null,null,null,null,0,0]
["Licences and Rights",null,{"$f":"SUM(C144:C149)","v":1050000},{"$f":"SUM(D144:D149)","v":0},0,0,0,0,0,0,1050000,{"$f":"SUM(L144:L149)","v":0},{"$f":"SUM(M144:M149)","v":0}]
["Water Rights",null,null,null,null,null,null,null,null,0,0]
["Effluent Licenses",null,null,null,null,null,null,null,null,0,0]
["Solid Waste Licenses",null,null,null,null,null,null,null,null,0,0]
["Computer Software and Applications",null,{"$f":"800000+250000","v":1050000},null,null,null,null,null,null,0,1050000,0,0]
["Load Settlement Software Applications",null,null,null,null,null,null,null,null,0,0]
["Unspecified",null,null,null,null,null,null,null,null,0,0]
[]
["Computer Equipment",null,{"$f":"SUM(C152:C152)","v":380000},0,0,0,0,0,0,0,380000,0,0]
["Computer Equipment",null,{"$f":"180000+200000","v":380000},null,null,null,null,null,null,0,380000,0,0]
[]
["Furniture and Office Equipment",null,{"$f":"SUM(C155:C155)","v":1660000},0,0,0,0,0,806838,806838,2466838,0,0]
["Furniture and Office Equipment",null,{"$f":"1300000+150000+200000+10000","v":1660000},null,null,null,null,null,806838,806838,2466838,0,0]
[]
["Machinery and Equipment",null,{"$f":"SUM(C158:C158)","v":9750000},0,0,0,0,0,2000000,2000000,11750000,1200000,0]
["Machinery and Equipment",null,{"$f":"1200000+400000+1500000+900000+2500000+1400000+1200000+400000+250000","v":9750000},null,null,null,null,null,2000000,2000000,11750000,{"$f":"1200000","v":1200000},0]
[]
["Transport Assets",null,{"$f":"SUM(C161:C161)","v":1100000},0,0,0,0,0,0,0,1100000,0,0]
["Transport Assets",null,{"$f":"600000+500000","v":1100000},null,null,null,null,null,0,0,1100000,0,0]
[]
["Land",null,{"$f":"SUM(C164:C164)","v":0},0,0,0,0,0,0,0,0,0,0]
["Land",null,null,null,null,null,null,null,null,0,0]
[]
["Zoo's, Marine and Non-biological Animals",null,{"$f":"SUM(C167:C167)","v":0},0,0,0,0,0,0,0,0,0,0]
["Zoo's, Marine and Non-biological Animals",null,null,null,null,null,null,null,null,0,0]
[]
["Total Capital Expenditure on new assets to be adjusted",1,{"$f":"C8+C76+C105+C112+C120+C151+C138+C141+C154+C157+C160+C163+C166","v":152192808.31999999},{"$f":"D8+D76+D105+D112+D120+D151+D138+D141+D154+D157+D160+D163+D166","v":0},0,0,0,0,-5615605,-5615605,146577203.31999999,174388883,192009876]
[]
[{"$f":"head27a","v":"References"}]
["1. Total Capital Expenditure on new assets (SB18a) plus Total Capital Expenditure on renewal of existing assets (SB18b) plus Total Capital Expenditure on upgrading of existing assets (SB18e) must reconcile to total capital expenditure in Budgeted Capital Expenditure"]
["7. Only complete if a previous adjusted budget has been approved in the same financial year. Reflect most recent adjusted budget."]
["8. Additional cash-backed accumulated funds/unspent funds (section 18(1)(b) and section 28(2)(e) MFMA) identified after Original Budget approved and after annual financial statements audited (note: only where underspending could not reasonably be have for"]
["9. Increases of funds approved under section 31 MFMA"]
["10. Adjustments approved in accordance with section 29 MFMA"]
["11. Adjustments to funding allocations from National or Provincial Government"]
["12. Adjusts. = 'Other' Adjustments proposed to be approved; including revenue under-collection (MFMA section 28(2)(a)); additional revenue appropriation on existing programmes (section 28(2))(b); projected savings (section 28(2)(d)); error correction (sec"]
["13. G = B + C + D + E + F"]
["14. Adjusted Budget H = (A or A1/2 etc) + G"]
[]
[]
["check balance",null,{"$f":"(C169+SB18b!C169+SB18e!C169)-'B5-Capex'!C65","v":-1000.0000000298023},null,null,null,null,null,null,null,null,{"$f":"(L169+SB18b!L169+SB18e!L169)-'B5-Capex'!L65","v":0},{"$f":"(M169+SB18b!M169+SB18e!M169)-'B5-Capex'!M65","v":0}]

{"sheet":"SB18b","index":37,"n_rows":183,"n_cols":13,"rows_kept":183,"cut":false,"hidden":false,"merged":[[1,0,3,0],[1,1,3,1],[1,2,1,10],[172,0,172,12],[179,0,179,12],[173,0,173,9],[174,0,174,9],[175,0,175,12],[177,0,177,12]]}
[{"$f":"muni&\" - \"&ADJB18b&\" - \"&Date","v":"LIM332 Greater Letaba - Supporting Table SB18b Adjustments Budget - capital expenditure on renewal of existing assets by asset class - 27 February 2019"}]
[{"$f":"desc","v":"Description"},{"$f":"head27","v":"Ref"},{"$f":"Head2","v":"Budget Year 2018/19"},null,null,null,null,null,null,null,null,{"$f":"Head10","v":"Budget Year +1 2019/20"},{"$f":"Head11","v":"Budget Year +2 2020/21"}]
[null,null,{"$f":"Head6","v":"Original Budget"},{"$f":"Head54","v":"Prior Adjusted"},{"$f":"Head51","v":"Accum. Funds"},{"$f":"Head52","v":"Multi-year capital"},{"$f":"Head53","v":"Unfore. Unavoid."},{"$f":"Head55","v":"Nat. or Prov. Govt"},{"$f":"Head50","v":"Other Adjusts."},{"$f":"Head56","v":"Total Adjusts."},{"$f":"Head7","v":"Adjusted Budget"},{"$f":"Head7","v":"Adjusted Budget"},{"$f":"Head7","v":"Adjusted Budget"}]
[null,null,null,7,8,9,10,11,12,13,14]
["R thousands",null,"A","A1","B","C","D","E","F","G","H"]
["Capital expenditure on renewal of existing assets by Asset Class/Sub-class"]
[]
["Infrastructure",null,{"$f":"C9+C14+C18+C28+C70+C39+C46+C54+C64","v":0},{"$f":"D9+D14+D18+D28+D70+D39+D46+D54+D64","v":0},0,0,0,0,0,{"$f":"SUM(E8:I8)","v":0},{"$f":"IF(D8=0,C8+J8,D8+J8)","v":0},{"$f":"L9+L14+L18+L28+L70+L39+L46+L54+L64","v":0},{"$f":"M9+M14+M18+M28+M70+M39+M46+M54+M64","v":0}]
["Roads Infrastructure",null,{"$f":"SUM(C10:C13)","v":0},{"$f":"SUM(D10:D13)","v":0},0,0,0,0,0,{"$f":"SUM(E9:I9)","v":0},{"$f":"IF(D9=0,C9+J9,D9+J9)","v":0},0,0]
["Roads",null,null,null,null,null,null,null,null,0,0]
["Road Structures",null,null,null,null,null,null,null,null,0,0]
["Road Furniture",null,null,null,null,null,null,null,null,0,0]
["Capital Spares",null,null,null,null,null,null,null,null,0,0]
["Storm water Infrastructure",null,{"$f":"SUM(C15:C17)","v":0},0,0,0,0,0,0,0,0,{"$f":"SUM(L15:L17)","v":0},{"$f":"SUM(M15:M17)","v":0}]
["Drainage Collection",null,null,null,null,null,null,null,null,0,0]
["Storm water Conveyance",null,null,null,null,null,null,null,null,0,0]
["Attenuation",null,null,null,null,null,null,null,null,0,0]
["Electrical Infrastructure",null,{"$f":"SUM(C19:C27)","v":0},0,0,0,0,0,0,0,0,0,0]
["Power Plants",null,null,null,null,null,null,null,null,0,0]
["HV Substations",null,null,null,null,null,null,null,null,0,0]
["HV Switching Station",null,null,null,null,null,null,null,null,0,0]
["HV Transmission Conductors",null,null,null,null,null,null,null,null,0,0]
["MV Substations",null,null,null,null,null,null,null,null,0,0]
["MV Switching Stations",null,null,null,null,null,null,null,null,0,0]
["MV Networks",null,null,null,null,null,null,null,null,0,0]
["LV Networks",null,null,null,null,null,null,null,null,0,0]
["Capital Spares",null,null,null,null,null,null,null,null,0,0]
["Water Supply Infrastructure",null,{"$f":"SUM(C29:C38)","v":0},0,0,0,0,0,0,0,0,0,0]
["Dams and Weirs",null,null,null,null,null,null,null,null,0,0]
["Boreholes",null,null,null,null,null,null,null,null,0,0]
["Reservoirs",null,null,null,null,null,null,null,null,0,0]
["Pump Stations",null,null,null,null,null,null,null,null,0,0]
["Water Treatment Works",null,null,null,null,null,null,null,null,0,0]
["Bulk Mains",null,null,null,null,null,null,null,null,0,0]
["Distribution",null,null,null,null,null,null,null,null,0,0]
["Distribution Points",null,null,null,null,null,null,null,null,0,0]
["PRV Stations",null,null,null,null,null,null,null,null,0,0]
["Capital Spares",null,null,null,null,null,null,null,null,0,0]
["Sanitation Infrastructure",null,{"$f":"SUM(C40:C45)","v":0},{"$f":"SUM(D40:D45)","v":0},0,0,0,0,0,0,0,0,0]
["Pump Station",null,null,null,null,null,null,null,null,0,0]
["Reticulation",null,null,null,null,null,null,null,null,0,0]
["Waste Water Treatment Works",null,null,null,null,null,null,null,null,0,0]
["Outfall Sewers",null,null,null,null,null,null,null,null,0,0]
["Toilet Facilities",null,null,null,null,null,null,null,null,0,0]
["Capital Spares",null,null,null,null,null,null,null,null,0,0]
["Solid Waste Infrastructure",null,{"$f":"SUM(C47:C53)","v":0},{"$f":"SUM(D47:D53)","v":0},0,0,0,0,0,0,0,0,0]
["Landfill Sites",null,null,null,null,null,null,null,null,0,0]
["Waste Transfer Stations",null,null,null,null,null,null,null,null,0,0]
["Waste Processing Facilities",null,null,null,null,null,null,null,null,0,0]
["Waste Drop-off Points",null,null,null,null,null,null,null,null,0,0]
["Waste Separation Facilities",null,null,null,null,null,null,null,null,0,0]
["Electricity Generation Facilities",null,null,null,null,null,null,null,null,0,0]
["Capital Spares",null,null,null,null,null,null,null,null,0,0]
["Rail Infrastructure",null,{"$f":"SUM(C55:C63)","v":0},{"$f":"SUM(D55:D63)","v":0},0,0,0,0,0,0,0,0,0]
["Rail Lines",null,null,null,null,null,null,null,null,0,0]
["Rail Structures",null,null,null,null,null,null,null,null,0,0]
["Rail Furniture",null,null,null,null,null,null,null,null,0,0]
["Drainage Collection",null,null,null,null,null,null,null,null,0,0]
["Storm water Conveyance",null,null,null,null,null,null,null,null,0,0]
["Attenuation",null,null,null,null,null,null,null,null,0,0]
["MV Substations",null,null,null,null,null,null,null,null,0,0]
["LV Networks",null,null,null,null,null,null,null,null,0,0]
["Capital Spares",null,null,null,null,null,null,null,null,0,0]
["Coastal Infrastructure",null,{"$f":"SUM(C65:C69)","v":0},0,0,0,0,0,0,0,0,0,0]
["Sand Pumps",null,null,null,null,null,null,null,null,0,0]
["Piers",null,null,null,null,null,null,null,null,0,0]
["Revetments",null,null,null,null,null,null,null,null,0,0]
["Promenades",null,null,null,null,null,null,null,null,0,0]
["Capital Spares",null,null,null,null,null,null,null,null,0,0]
["Information and Communication Infrastructure",null,{"$f":"SUM(C71:C74)","v":0},0,0,0,0,0,0,0,0,0,0]
["Data Centres",null,null,null,null,null,null,null,null,0,0]
["Core Layers",null,null,null,null,null,null,null,null,0,0]
["Distribution Layers",null,null,null,null,null,null,null,null,{"$f":"SUM(E73:I73)","v":0},{"$f":"IF(D73=0,C73+J73,D73+J73)","v":0}]
["Capital Spares",null,null,null,null,null,null,null,null,{"$f":"SUM(E74:I74)","v":0},{"$f":"IF(D74=0,C74+J74,D74+J74)","v":0}]
[]
["Community Assets",null,{"$f":"+C77+C100","v":27083510.539999999},{"$f":"+D77+D100","v":0},{"$f":"+E77+E100","v":0},0,0,0,0,{"$f":"SUM(E76:I76)","v":0},{"$f":"IF(D76=0,C76+J76,D76+J76)","v":27083510.539999999},0,0]
["Community Facilities",null,{"$f":"SUM(C78:C99)","v":0},{"$f":"SUM(D78:D99)","v":0},0,0,0,0,0,0,0,{"$f":"SUM(L78:L99)","v":0},{"$f":"SUM(M78:M99)","v":0}]
["Halls",null,null,null,null,null,null,null,null,0,0]
["Centres",null,null,null,null,null,null,null,null,0,0]
["Crèches",null,null,null,null,null,null,null,null,0,0]
["Clinics/Care Centres",null,null,null,null,null,null,null,null,0,0]
["Fire/Ambulance Stations",null,null,null,null,null,null,null,null,0,0]
["Testing Stations",null,null,null,null,null,null,null,null,0,0]
["Museums",null,null,null,null,null,null,null,null,0,0]
["Galleries",null,null,null,null,null,null,null,null,0,0]
["Theatres",null,null,null,null,null,null,null,null,0,0]
["Libraries",null,null,null,null,null,null,null,null,0,0]
["Cemeteries/Crematoria",null,null,null,null,null,null,null,null,0,0]
["Police",null,null,null,null,null,null,null,null,0,0]
["Purls",null,null,null,null,null,null,null,null,0,0]
["Public Open Space",null,null,null,null,null,null,null,null,0,0]
["Nature Reserves",null,null,null,null,null,null,null,null,0,0]
["Public Ablution Facilities",null,null,null,null,null,null,null,null,0,0]
["Markets",null,null,null,null,null,null,null,null,0,0]
["Stalls",null,null,null,null,null,null,null,null,0,0]
["Abattoirs",null,null,null,null,null,null,null,null,0,0]
["Airports",null,null,null,null,null,null,null,null,0,0]
["Taxi Ranks/Bus Terminals",null,null,null,null,null,null,null,null,0,0]
["Capital Spares",null,null,null,null,null,null,null,null,0,0]
["Sport and Recreation Facilities",null,{"$f":"SUM(C101:C103)","v":27083510.539999999},{"$f":"SUM(D101:D103)","v":0},0,0,0,0,0,0,27083510.539999999,0,0]
["Indoor Facilities",null,null,null,null,null,null,null,null,0,0]
["Outdoor Facilities",null,{"$f":"11001978+16081532.54","v":27083510.539999999},null,null,null,null,null,null,0,27083510.539999999]
["Capital Spares",null,null,null,null,null,null,null,null,0,0]
[]
["Heritage assets",null,{"$f":"SUM(C106:C110)","v":0},0,0,0,0,0,0,0,0,0,0]
["Monuments",null,null,null,null,null,null,null,null,0,0]
["Historic Buildings",null,null,null,null,null,null,null,null,0,0]
["Works of Art",null,null,null,null,null,null,null,null,0,0]
["Conservation Areas",null,null,null,null,null,null,null,null,0,0]
["Other Heritage",null,null,null,null,null,null,null,null,0,0]
[]
["Investment properties",null,{"$f":"+C113+C116","v":0},{"$f":"+D113+D116","v":0},0,0,0,0,0,0,0,{"$f":"+L113+L116","v":0},{"$f":"+M113+M116","v":0}]
["Revenue Generating",null,{"$f":"SUM(C114:C115)","v":0},{"$f":"SUM(D114:D115)","v":0},{"$f":"SUM(E114:E115)","v":0},0,0,0,0,0,0,0,0]
["Improved Property",null,null,null,null,null,null,null,null,0,0]
["Unimproved Property",null,null,null,null,null,null,null,null,0,0]
["Non-revenue Generating",null,{"$f":"SUM(C117:C118)","v":0},{"$f":"SUM(D117:D118)","v":0},{"$f":"SUM(E117:E118)","v":0},0,0,0,0,0,0,0,0]
["Improved Property",null,null,null,null,null,null,null,null,0,0]
["Unimproved Property",null,null,null,null,null,null,null,null,0,0]
[]
["Other assets",null,{"$f":"+C121+C133","v":0},{"$f":"+D121+D133","v":0},0,0,0,0,0,0,0,{"$f":"+L121+L133","v":0},{"$f":"+M121+M133","v":0}]
["Operational Buildings",null,{"$f":"SUM(C122:C132)","v":0},{"$f":"SUM(D122:D132)","v":0},0,0,0,0,0,0,0,{"$f":"SUM(L122:L132)","v":0},{"$f":"SUM(M122:M132)","v":0}]
["Municipal Offices",null,null,null,null,null,null,null,null,0,0]
["Pay/Enquiry Points",null,null,null,null,null,null,null,null,0,0]
["Building Plan Offices",null,null,null,null,null,null,null,null,0,0]
["Workshops",null,null,null,null,null,null,null,null,0,0]
["Yards",null,null,null,null,null,null,null,null,0,0]
["Stores",null,null,null,null,null,null,null,null,0,0]
["Laboratories",null,null,null,null,null,null,null,null,0,0]
["Training Centres",null,null,null,null,null,null,null,null,0,0]
["Manufacturing Plant",null,null,null,null,null,null,null,null,0,0]
["Depots",null,null,null,null,null,null,null,null,0,0]
["Capital Spares",null,null,null,null,null,null,null,null,0,0]
["Housing",null,{"$f":"SUM(C134:C136)","v":0},{"$f":"SUM(D134:D136)","v":0},{"$f":"SUM(E134:E136)","v":0},0,0,0,0,0,0,0,0]
["Staff Housing",null,null,null,null,null,null,null,null,0,0]
["Social Housing",null,null,null,null,null,null,null,null,0,0]
["Capital Spares",null,null,null,null,null,null,null,null,0,0]
[]
["Biological or Cultivated Assets",null,{"$f":"SUM(C139:C139)","v":0},0,0,0,0,0,0,0,0,0,0]
["Biological or Cultivated Assets",null,null,null,null,null,null,null,null,0,0]
[]
["Intangible Assets",null,{"$f":"SUM(C142:C143)","v":0},{"$f":"SUM(D142:D143)","v":0},0,0,0,0,0,{"$f":"SUM(E141:I141)","v":0},{"$f":"IF(D141=0,C141+J141,D141+J141)","v":0},{"$f":"SUM(L142:L143)","v":0},{"$f":"SUM(M142:M143)","v":0}]
["Servitudes",null,null,null,null,null,null,null,null,0,0]
["Licences and Rights",null,{"$f":"SUM(C144:C149)","v":0},{"$f":"SUM(D144:D149)","v":0},0,0,0,0,0,0,0,{"$f":"SUM(L144:L149)","v":0},{"$f":"SUM(M144:M149)","v":0}]
["Water Rights",null,null,null,null,null,null,null,null,0,0]
["Effluent Licenses",null,null,null,null,null,null,null,null,0,0]
["Solid Waste Licenses",null,null,null,null,null,null,null,null,0,0]
["Computer Software and Applications",null,null,null,null,null,null,null,null,0,0]
["Load Settlement Software Applications",null,null,null,null,null,null,null,null,0,0]
["Unspecified",null,null,null,null,null,null,null,null,0,0]
[]
["Computer Equipment",null,{"$f":"SUM(C152:C152)","v":0},0,0,0,0,0,0,0,0,0,0]
["Computer Equipment",null,null,null,null,null,null,null,null,{"$f":"SUM(E152:I152)","v":0},{"$f":"IF(D152=0,C152+J152,D152+J152)","v":0}]
[]
["Furniture and Office Equipment",null,{"$f":"SUM(C155:C155)","v":0},0,0,0,0,0,0,{"$f":"SUM(E154:I154)","v":0},{"$f":"IF(D154=0,C154+J154,D154+J154)","v":0},0,0]
["Furniture and Office Equipment",null,null,null,null,null,null,null,null,{"$f":"SUM(E155:I155)","v":0},{"$f":"IF(D155=0,C155+J155,D155+J155)","v":0}]
[]
["Machinery and Equipment",null,{"$f":"SUM(C158:C158)","v":0},0,0,0,0,0,0,{"$f":"SUM(E157:I157)","v":0},{"$f":"IF(D157=0,C157+J157,D157+J157)","v":0},0,0]
["Machinery and Equipment",null,null,null,null,null,null,null,null,{"$f":"SUM(E158:I158)","v":0},{"$f":"IF(D158=0,C158+J158,D158+J158)","v":0}]
[]
["Transport Assets",null,{"$f":"SUM(C161:C161)","v":0},0,0,0,0,0,0,{"$f":"SUM(E160:I160)","v":0},{"$f":"IF(D160=0,C160+J160,D160+J160)","v":0},0,0]
["Transport Assets",null,null,null,null,null,null,null,null,{"$f":"SUM(E161:I161)","v":0},{"$f":"IF(D161=0,C161+J161,D161+J161)","v":0}]
[]
["Land",null,{"$f":"SUM(C164:C164)","v":0},0,0,0,0,0,0,{"$f":"SUM(E163:I163)","v":0},{"$f":"IF(D163=0,C163+J163,D163+J163)","v":0},0,0]
["Land",null,null,null,null,null,null,null,null,{"$f":"SUM(E164:I164)","v":0},{"$f":"IF(D164=0,C164+J164,D164+J164)","v":0}]
[]
["Zoo's, Marine and Non-biological Animals",null,{"$f":"SUM(C167:C167)","v":0},0,0,0,0,0,0,{"$f":"SUM(E166:I166)","v":0},{"$f":"IF(D166=0,C166+J166,D166+J166)","v":0},0,0]
["Zoo's, Marine and Non-biological Animals",null,null,null,null,null,null,null,null,{"$f":"SUM(E167:I167)","v":0},{"$f":"IF(D167=0,C167+J167,D167+J167)","v":0}]
[]
["Total Capital Expenditure on renewal of existing assets to be adjusted",1,{"$f":"C8+C76+C105+C112+C120+C151+C138+C141+C154+C157+C160+C163+C166","v":27083510.539999999},{"$f":"D8+D76+D105+D112+D120+D151+D138+D141+D154+D157+D160+D163+D166","v":0},0,0,0,0,0,{"$f":"SUM(E169:I169)","v":0},{"$f":"IF(D169=0,C169+J169,D169+J169)","v":27083510.539999999},0,0]
[]
[{"$f":"head27a","v":"References"}]
["1. Total Capital Expenditure  on renewal of existing assets (SB18b) plus Total Capital Expenditure on new assets (SB18a) plus Total Capital Expenditure  on upgrading of existing assets (SB18e) must reconcile to total capital expenditure in Budgeted Capital Expenditure"]
["7. Only complete if a previous adjusted budget has been approved in the same financial year. Reflect most recent adjusted budget."]
["8. Additional cash-backed accumulated funds/unspent funds (section 18(1)(b) and section 28(2)(e) MFMA) identified after Original Budget approved and after annual financial statements audited (note: only where underspending could not reasonably be have for"]
["9. Increases of funds approved under section 31 MFMA"]
["10. Adjustments approved in accordance with section 29 MFMA"]
["11. Adjustments to funding allocations from National or Provincial Government"]
["12. Adjusts. = 'Other' Adjustments proposed to be approved; including revenue under-collection (MFMA section 28(2)(a)); additional revenue appropriation on existing programmes (section 28(2))(b); projected savings (section 28(2)(d)); error correction (sec"]
["13. G = B + C + D + E + F"]
["14. Adjusted Budget H = (A or A1/2 etc) + G"]
[]
[]
["check balance",null,{"$f":"(C169+SB18a!C169+SB18e!C169)-'B5-Capex'!C65","v":-1000.0000000298023},null,null,null,null,null,null,null,null,{"$f":"(L169+SB18a!L169+SB18e!L169)-'B5-Capex'!L65","v":0},{"$f":"(M169+SB18a!M169+SB18e!M169)-'B5-Capex'!M65","v":0}]

{"sheet":"SB18c","index":38,"n_rows":182,"n_cols":13,"rows_kept":182,"cut":false,"hidden":false,"merged":[[1,0,3,0],[1,1,3,1],[1,2,1,10],[171,0,171,12],[178,0,178,12],[172,0,172,9],[173,0,173,9],[174,0,174,12],[176,0,176,12]]}
[{"$f":"muni&\" - \"&ADJB18c&\" - \"&Date","v":"LIM332 Greater Letaba - Supporting Table SB18c Adjustments Budget - expenditure on repairs and maintenance by asset class - 27 February 2019"}]
[{"$f":"desc","v":"Description"},{"$f":"head27","v":"Ref"},{"$f":"Head2","v":"Budget Year 2018/19"},null,null,null,null,null,null,null,null,{"$f":"Head10","v":"Budget Year +1 2019/20"},{"$f":"Head11","v":"Budget Year +2 2020/21"}]
[null,null,{"$f":"Head6","v":"Original Budget"},{"$f":"Head54","v":"Prior Adjusted"},{"$f":"Head51","v":"Accum. Funds"},{"$f":"Head52","v":"Multi-year capital"},{"$f":"Head53","v":"Unfore. Unavoid."},{"$f":"Head55","v":"Nat. or Prov. Govt"},{"$f":"Head50","v":"Other Adjusts."},{"$f":"Head56","v":"Total Adjusts."},{"$f":"Head7","v":"Adjusted Budget"},{"$f":"Head7","v":"Adjusted Budget"},{"$f":"Head7","v":"Adjusted Budget"}]
[null,null,null,7,8,9,10,11,12,13,14]
["R thousands",null,"A","A1","B","C","D","E","F","G","H"]
["Repairs and maintenance expenditure by Asset Class/Sub-class"]
[]
["Infrastructure",null,{"$f":"C9+C14+C18+C28+C70+C39+C46+C54+C64","v":14068174},{"$f":"D9+D14+D18+D28+D70+D39+D46+D54+D64","v":0},0,0,0,0,668652,{"$f":"SUM(E8:I8)","v":668652},{"$f":"IF(D8=0,C8+J8,D8+J8)","v":14736826},{"$f":"L9+L14+L18+L28+L70+L39+L46+L54+L64","v":4558000},{"$f":"M9+M14+M18+M28+M70+M39+M46+M54+M64","v":6412000}]
["Roads Infrastructure",null,{"$f":"SUM(C10:C13)","v":9315704},{"$f":"SUM(D10:D13)","v":0},0,0,0,0,668652,{"$f":"SUM(E9:I9)","v":668652},{"$f":"IF(D9=0,C9+J9,D9+J9)","v":9984356},2549000,3799000]
["Roads",null,{"$f":"4315704+5000000","v":9315704},null,null,null,null,null,668652,668652,9984356,2549000,3799000]
["Road Structures",null,null,null,null,null,null,null,null,0,0]
["Road Furniture",null,null,null,null,null,null,null,null,0,0]
["Capital Spares",null,null,null,null,null,null,null,null,0,0]
["Storm water Infrastructure",null,{"$f":"SUM(C15:C17)","v":0},0,0,0,0,0,0,0,0,{"$f":"SUM(L15:L17)","v":0},{"$f":"SUM(M15:M17)","v":0}]
["Drainage Collection",null,null,null,null,null,null,null,null,0,0]
["Storm water Conveyance",null,null,null,null,null,null,null,null,0,0]
["Attenuation",null,null,null,null,null,null,null,null,0,0]
["Electrical Infrastructure",null,{"$f":"SUM(C19:C27)","v":4752470},0,0,0,0,0,0,0,4752470,2009000,2613000]
["Power Plants",null,null,null,null,null,null,null,null,0,0]
["HV Substations",null,null,null,null,null,null,null,null,0,0]
["HV Switching Station",null,null,null,null,null,null,null,null,0,0]
["HV Transmission Conductors",null,null,null,null,null,null,null,null,0,0]
["MV Substations",null,null,null,null,null,null,null,null,0,0]
["MV Switching Stations",null,null,null,null,null,null,null,null,0,0]
["MV Networks",null,1300000,null,null,null,null,null,null,0,1300000,370000,{"$f":"1446000-672000","v":774000}]
["LV Networks",null,{"$f":"116611+935859+400000","v":1452470},null,null,null,null,null,null,0,1452470,531000,615000]
["Capital Spares",null,2000000,null,null,null,null,null,null,0,2000000,1108000,1224000]
["Water Supply Infrastructure",null,{"$f":"SUM(C29:C38)","v":0},0,0,0,0,0,0,0,0,0,0]
["Dams and Weirs",null,null,null,null,null,null,null,null,0,0]
["Boreholes",null,null,null,null,null,null,null,null,0,0]
["Reservoirs",null,null,null,null,null,null,null,null,0,0]
["Pump Stations",null,null,null,null,null,null,null,null,0,0]
["Water Treatment Works",null,null,null,null,null,null,null,null,0,0]
["Bulk Mains",null,null,null,null,null,null,null,null,0,0]
["Distribution",null,null,null,null,null,null,null,null,0,0]
["Distribution Points",null,null,null,null,null,null,null,null,0,0]
["PRV Stations",null,null,null,null,null,null,null,null,0,0]
["Capital Spares",null,null,null,null,null,null,null,null,0,0]
["Sanitation Infrastructure",null,{"$f":"SUM(C40:C45)","v":0},{"$f":"SUM(D40:D45)","v":0},0,0,0,0,0,0,0,0,0]
["Pump Station",null,null,null,null,null,null,null,null,0,0]
["Reticulation",null,null,null,null,null,null,null,null,0,0]
["Waste Water Treatment Works",null,null,null,null,null,null,null,null,0,0]
["Outfall Sewers",null,null,null,null,null,null,null,null,0,0]
["Toilet Facilities",null,null,null,null,null,null,null,null,0,0]
["Capital Spares",null,null,null,null,null,null,null,null,0,0]
["Solid Waste Infrastructure",null,{"$f":"SUM(C47:C53)","v":0},{"$f":"SUM(D47:D53)","v":0},0,0,0,0,0,0,0,0,0]
["Landfill Sites",null,null,null,null,null,null,null,null,0,0]
["Waste Transfer Stations",null,null,null,null,null,null,null,null,0,0]
["Waste Processing Facilities",null,null,null,null,null,null,null,null,0,0]
["Waste Drop-off Points",null,null,null,null,null,null,null,null,0,0]
["Waste Separation Facilities",null,null,null,null,null,null,null,null,0,0]
["Electricity Generation Facilities",null,null,null,null,null,null,null,null,0,0]
["Capital Spares",null,null,null,null,null,null,null,null,0,0]
["Rail Infrastructure",null,{"$f":"SUM(C55:C63)","v":0},{"$f":"SUM(D55:D63)","v":0},0,0,0,0,0,0,0,0,0]
["Rail Lines",null,null,null,null,null,null,null,null,0,0]
["Rail Structures",null,null,null,null,null,null,null,null,0,0]
["Rail Furniture",null,null,null,null,null,null,null,null,0,0]
["Drainage Collection",null,null,null,null,null,null,null,null,0,0]
["Storm water Conveyance",null,null,null,null,null,null,null,null,0,0]
["Attenuation",null,null,null,null,null,null,null,null,0,0]
["MV Substations",null,null,null,null,null,null,null,null,0,0]
["LV Networks",null,null,null,null,null,null,null,null,0,0]
["Capital Spares",null,null,null,null,null,null,null,null,0,0]
["Coastal Infrastructure",null,{"$f":"SUM(C65:C69)","v":0},0,0,0,0,0,0,0,0,0,0]
["Sand Pumps",null,null,null,null,null,null,null,null,0,0]
["Piers",null,null,null,null,null,null,null,null,0,0]
["Revetments",null,null,null,null,null,null,null,null,0,0]
["Promenades",null,null,null,null,null,null,null,null,0,0]
["Capital Spares",null,null,null,null,null,null,null,null,0,0]
["Information and Communication Infrastructure",null,{"$f":"SUM(C71:C74)","v":0},0,0,0,0,0,0,0,0,0,0]
["Data Centres",null,null,null,null,null,null,null,null,0,0]
["Core Layers",null,null,null,null,null,null,null,null,0,0]
["Distribution Layers",null,null,null,null,null,null,null,null,{"$f":"SUM(E73:I73)","v":0},{"$f":"IF(D73=0,C73+J73,D73+J73)","v":0}]
["Capital Spares",null,null,null,null,null,null,null,null,0,0]
[]
["Community Assets",null,{"$f":"+C77+C100","v":749933},{"$f":"+D77+D100","v":0},{"$f":"+E77+E100","v":0},0,0,0,0,0,749933,791000,834000]
["Community Facilities",null,{"$f":"SUM(C78:C99)","v":549933},{"$f":"SUM(D78:D99)","v":0},{"$f":"SUM(E78:E99)","v":0},0,0,0,0,0,549933,580000,612000]
["Halls",null,{"$f":"521024+28909","v":549933},null,null,null,null,null,null,0,549933,580000,612000]
["Centres",null,null,null,null,null,null,null,null,0,0]
["Crèches",null,null,null,null,null,null,null,null,0,0]
["Clinics/Care Centres",null,null,null,null,null,null,null,null,0,0]
["Fire/Ambulance Stations",null,null,null,null,null,null,null,null,0,0]
["Testing Stations",null,null,null,null,null,null,null,null,0,0]
["Museums",null,null,null,null,null,null,null,null,0,0]
["Galleries",null,null,null,null,null,null,null,null,0,0]
["Theatres",null,null,null,null,null,null,null,null,0,0]
["Libraries",null,null,null,null,null,null,null,null,0,0]
["Cemeteries/Crematoria",null,null,null,null,null,null,null,null,0,0]
["Police",null,null,null,null,null,null,null,null,0,0]
["Purls",null,null,null,null,null,null,null,null,0,0]
["Public Open Space",null,null,null,null,null,null,null,null,0,0]
["Nature Reserves",null,null,null,null,null,null,null,null,0,0]
["Public Ablution Facilities",null,null,null,null,null,null,null,null,0,0]
["Markets",null,null,null,null,null,null,null,null,0,0]
["Stalls",null,null,null,null,null,null,null,null,0,0]
["Abattoirs",null,null,null,null,null,null,null,null,0,0]
["Airports",null,null,null,null,null,null,null,null,0,0]
["Taxi Ranks/Bus Terminals",null,null,null,null,null,null,null,null,0,0]
["Capital Spares",null,null,null,null,null,null,null,null,0,0]
["Sport and Recreation Facilities",null,{"$f":"SUM(C101:C103)","v":200000},{"$f":"SUM(D101:D103)","v":0},0,0,0,0,0,0,200000,211000,222000]
["Indoor Facilities",null,null,null,null,null,null,null,null,0,0]
["Outdoor Facilities",null,200000,null,null,null,null,null,null,0,200000,211000,222000]
["Capital Spares",null,null,null,null,null,null,null,null,0,0]
[]
["Heritage assets",null,{"$f":"SUM(C106:C110)","v":0},0,0,0,0,0,0,0,0,0,0]
["Monuments",null,null,null,null,null,null,null,null,0,0]
["Historic Buildings",null,null,null,null,null,null,null,null,0,0]
["Works of Art",null,null,null,null,null,null,null,null,0,0]
["Conservation Areas",null,null,null,null,null,null,null,null,0,0]
["Other Heritage",null,null,null,null,null,null,null,null,0,0]
[]
["Investment properties",null,{"$f":"+C113+C116","v":0},{"$f":"+D113+D116","v":0},0,0,0,0,0,0,0,{"$f":"+L113+L116","v":0},{"$f":"+M113+M116","v":0}]
["Revenue Generating",null,{"$f":"SUM(C114:C115)","v":0},{"$f":"SUM(D114:D115)","v":0},{"$f":"SUM(E114:E115)","v":0},0,0,0,0,0,0,0,0]
["Improved Property",null,null,null,null,null,null,null,null,0,0]
["Unimproved Property",null,null,null,null,null,null,null,null,0,0]
["Non-revenue Generating",null,{"$f":"SUM(C117:C118)","v":0},{"$f":"SUM(D117:D118)","v":0},{"$f":"SUM(E117:E118)","v":0},0,0,0,0,0,0,0,0]
["Improved Property",null,null,null,null,null,null,null,null,0,0]
["Unimproved Property",null,null,null,null,null,null,null,null,0,0]
[]
["Other assets",null,{"$f":"+C121+C133","v":1765731},{"$f":"+D121+D133","v":0},0,0,0,0,0,0,1765731,{"$f":"+L121+L133","v":863000},{"$f":"+M121+M133","v":965000}]
["Operational Buildings",null,{"$f":"SUM(C122:C132)","v":1765731},{"$f":"SUM(D122:D132)","v":0},0,0,0,0,0,0,1765731,{"$f":"SUM(L122:L132)","v":863000},{"$f":"SUM(M122:M132)","v":965000}]
["Municipal Offices",null,1765731,null,null,null,null,null,null,0,1765731,863000,965000]
["Pay/Enquiry Points",null,null,null,null,null,null,null,null,0,0]
["Building Plan Offices",null,null,null,null,null,null,null,null,0,0]
["Workshops",null,null,null,null,null,null,null,null,0,0]
["Yards",null,null,null,null,null,null,null,null,0,0]
["Stores",null,null,null,null,null,null,null,null,0,0]
["Laboratories",null,null,null,null,null,null,null,null,0,0]
["Training Centres",null,null,null,null,null,null,null,null,0,0]
["Manufacturing Plant",null,null,null,null,null,null,null,null,0,0]
["Depots",null,null,null,null,null,null,null,null,0,0]
["Capital Spares",null,null,null,null,null,null,null,null,0,0]
["Housing",null,{"$f":"SUM(C134:C136)","v":0},{"$f":"SUM(D134:D136)","v":0},{"$f":"SUM(E134:E136)","v":0},0,0,0,0,0,0,0,0]
["Staff Housing",null,null,null,null,null,null,null,null,0,0]
["Social Housing",null,null,null,null,null,null,null,null,0,0]
["Capital Spares",null,null,null,null,null,null,null,null,0,0]
[]
["Biological or Cultivated Assets",null,{"$f":"SUM(C139:C139)","v":0},0,0,0,0,0,0,{"$f":"SUM(E138:I138)","v":0},{"$f":"IF(D138=0,C138+J138,D138+J138)","v":0},0,0]
["Biological or Cultivated Assets",null,null,null,null,null,null,null,null,0,0]
[]
["Intangible Assets",null,{"$f":"SUM(C142:C143)","v":0},{"$f":"SUM(D142:D143)","v":0},{"$f":"SUM(E142:E143)","v":0},0,0,0,0,0,0,0,0]
["Servitudes",null,null,null,null,null,null,null,null,0,0]
["Licences and Rights",null,{"$f":"SUM(C144:C149)","v":0},{"$f":"SUM(D144:D149)","v":0},{"$f":"SUM(E144:E149)","v":0},0,0,0,0,0,0,0,0]
["Water Rights",null,null,null,null,null,null,null,null,0,0]
["Effluent Licenses",null,null,null,null,null,null,null,null,0,0]
["Solid Waste Licenses",null,null,null,null,null,null,null,null,0,0]
["Computer Software and Applications",null,null,null,null,null,null,null,null,0,0]
["Load Settlement Software Applications",null,null,null,null,null,null,null,null,0,0]
["Unspecified",null,null,null,null,null,null,null,null,0,0]
[]
["Computer Equipment",null,{"$f":"SUM(C152:C152)","v":1801663},0,0,0,0,0,0,0,1801663,1899000,1003000]
["Computer Equipment",null,{"$f":"21371+1780292","v":1801663},null,null,null,null,null,null,0,1801663,1899000,1003000]
[]
["Furniture and Office Equipment",null,{"$f":"SUM(C155:C155)","v":0},0,0,0,0,0,0,0,0,0,0]
["Furniture and Office Equipment",null,null,null,null,null,null,null,null,0,0]
[]
["Machinery and Equipment",null,{"$f":"SUM(C158:C158)","v":1100777.1400000011},0,0,0,0,0,0,0,1100777.1400000011,1161000,1224000]
["Machinery and Equipment",null,{"$f":"350000+65340+37550+2106+113454+6408+525919.140000001","v":1100777.1400000011},null,null,null,null,null,null,0,1100777.1400000011,1161000,1224000]
[]
["Transport Assets",null,{"$f":"SUM(C161:C161)","v":2612371},0,0,0,0,0,0,0,2612371,2361000,1905000]
["Transport Assets",null,{"$f":"308687+41963+23121+70122+10556+53285+1474200+203558+26408+400471","v":2612371},null,null,null,null,null,null,0,2612371,{"$f":"2754000-393000","v":2361000},1905000]
[]
["Land",null,{"$f":"SUM(C164:C164)","v":0},0,0,0,0,0,0,0,0,0,0]
["Land",null,null,null,null,null,null,null,null,0,0]
[]
["Zoo's, Marine and Non-biological Animals",null,{"$f":"SUM(C167:C167)","v":0},0,0,0,0,0,0,0,0,0,0]
["Zoo's, Marine and Non-biological Animals",null,null,null,null,null,null,null,null,0,0]
[]
["Total Repairs and Maintenance Expenditure to be adjusted",1,{"$f":"C8+C76+C105+C112+C120+C151+C138+C141+C154+C157+C160+C163+C166","v":22098649.140000001},{"$f":"D8+D76+D105+D112+D120+D151+D138+D141+D154+D157+D160+D163+D166","v":0},{"$f":"E8+E76+E105+E112+E120+E151+E138+E141+E154+E157+E160+E163+E166","v":0},0,0,0,668652,668652,22767301.140000001,11633000,12343000]
[{"$f":"head27a","v":"References"}]
["1. Total Repairs and Maintenance Expenditure by Asset Category must reconcile to total repairs and maintenance expenditure on Table SB1"]
["7. Only complete if a previous adjusted budget has been approved in the same financial year. Reflect most recent adjusted budget."]
["8. Additional cash-backed accumulated funds/unspent funds (section 18(1)(b) and section 28(2)(e) MFMA) identified after Original Budget approved and after annual financial statements audited (note: only where underspending could not reasonably be have for"]
["9. Increases of funds approved under section 31 MFMA"]
["10. Adjustments approved in accordance with section 29 MFMA"]
["11. Adjustments to funding allocations from National or Provincial Government"]
["12. Adjusts. = 'Other' Adjustments proposed to be approved; including revenue under-collection (MFMA section 28(2)(a)); additional revenue appropriation on existing programmes (section 28(2))(b); projected savings (section 28(2)(d)); error correction (sec"]
["13. G = B + C + D + E + F"]
["14. Adjusted Budget H = (A or A1/2 etc) + G"]
[]
[]
["check balance"]

{"sheet":"SB18d","index":39,"n_rows":182,"n_cols":13,"rows_kept":182,"cut":false,"hidden":false,"merged":[[174,0,174,12],[176,0,176,12],[178,0,178,12],[1,0,3,0],[1,1,3,1],[1,2,1,10],[171,0,171,12],[172,0,172,9],[173,0,173,9]]}
[{"$f":"muni&\" - \"&ADJB18d&\" - \"&Date","v":"LIM332 Greater Letaba - Supporting Table SB18d Adjustments Budget - depreciation by asset class - 27 February 2019"}]
[{"$f":"desc","v":"Description"},{"$f":"head27","v":"Ref"},{"$f":"Head2","v":"Budget Year 2018/19"},null,null,null,null,null,null,null,null,{"$f":"Head10","v":"Budget Year +1 2019/20"},{"$f":"Head11","v":"Budget Year +2 2020/21"}]
[null,null,{"$f":"Head6","v":"Original Budget"},{"$f":"Head54","v":"Prior Adjusted"},{"$f":"Head51","v":"Accum. Funds"},{"$f":"Head52","v":"Multi-year capital"},{"$f":"Head53","v":"Unfore. Unavoid."},{"$f":"Head55","v":"Nat. or Prov. Govt"},{"$f":"Head50","v":"Other Adjusts."},{"$f":"Head56","v":"Total Adjusts."},{"$f":"Head7","v":"Adjusted Budget"},{"$f":"Head7","v":"Adjusted Budget"},{"$f":"Head7","v":"Adjusted Budget"}]
[null,null,null,7,8,9,10,11,12,13,14]
["R thousands",null,"A","A1","B","C","D","E","F","G","H"]
["Depreciation by Asset Class/Sub-class"]
[]
["Infrastructure",null,{"$f":"C9+C14+C18+C28+C70+C39+C46+C54+C64","v":4828858.2910000002},{"$f":"D9+D14+D18+D28+D70+D39+D46+D54+D64","v":0},0,0,0,0,648831.77,{"$f":"SUM(E8:I8)","v":648831.77},{"$f":"IF(D8=0,C8+J8,D8+J8)","v":5477690.0610000007},{"$f":"L9+L14+L18+L28+L70+L39+L46+L54+L64","v":6357542},{"$f":"M9+M14+M18+M28+M70+M39+M46+M54+M64","v":6436829}]
["Roads Infrastructure",null,{"$f":"SUM(C10:C13)","v":4779931.7970000003},{"$f":"SUM(D10:D13)","v":0},0,0,0,0,598831.77,{"$f":"SUM(E9:I9)","v":598831.77},{"$f":"IF(D9=0,C9+J9,D9+J9)","v":5378763.5669999998},6292542,6362829]
["Roads",null,{"$f":"9630652.707-4850720.91","v":4779931.7970000003},null,null,null,null,null,598831.77,598831.77,5378763.5669999998,6292542,6362829]
["Road Structures",null,null,null,null,null,null,null,null,0,0]
["Road Furniture",null,null,null,null,null,null,null,null,0,0]
["Capital Spares",null,null,null,null,null,null,null,null,0,0]
["Storm water Infrastructure",null,{"$f":"SUM(C15:C17)","v":0},0,0,0,0,0,0,0,0,{"$f":"SUM(L15:L17)","v":0},{"$f":"SUM(M15:M17)","v":0}]
["Drainage Collection",null,null,null,null,null,null,null,null,0,0]
["Storm water Conveyance",null,null,null,null,null,null,null,null,0,0]
["Attenuation",null,null,null,null,null,null,null,null,0,0]
["Electrical Infrastructure",null,{"$f":"SUM(C19:C27)","v":48926.493999999999},0,0,0,0,0,50000,50000,98926.494000000006,65000,74000]
["Power Plants",null,null,null,null,null,null,null,null,0,0]
["HV Substations",null,null,null,null,null,null,null,null,0,0]
["HV Switching Station",null,null,null,null,null,null,null,null,0,0]
["HV Transmission Conductors",null,null,null,null,null,null,null,null,0,0]
["MV Substations",null,null,null,null,null,null,null,null,0,0]
["MV Switching Stations",null,null,null,null,null,null,null,null,0,0]
["MV Networks",null,null,null,null,null,null,null,null,0,0]
["LV Networks",null,48926.493999999999,null,null,null,null,null,null,0,48926.493999999999]
["Capital Spares",null,null,null,null,null,null,null,50000,50000,50000,65000,74000]
["Water Supply Infrastructure",null,{"$f":"SUM(C29:C38)","v":0},0,0,0,0,0,0,0,0,0,0]
["Dams and Weirs",null,null,null,null,null,null,null,null,0,0]
["Boreholes",null,null,null,null,null,null,null,null,0,0]
["Reservoirs",null,null,null,null,null,null,null,null,0,0]
["Pump Stations",null,null,null,null,null,null,null,null,0,0]
["Water Treatment Works",null,null,null,null,null,null,null,null,0,0]
["Bulk Mains",null,null,null,null,null,null,null,null,0,0]
["Distribution",null,null,null,null,null,null,null,null,0,0]
["Distribution Points",null,null,null,null,null,null,null,null,0,0]
["PRV Stations",null,null,null,null,null,null,null,null,0,0]
["Capital Spares",null,null,null,null,null,null,null,null,0,0]
["Sanitation Infrastructure",null,{"$f":"SUM(C40:C45)","v":0},{"$f":"SUM(D40:D45)","v":0},0,0,0,0,0,0,0,0,0]
["Pump Station",null,null,null,null,null,null,null,null,0,0]
["Reticulation",null,null,null,null,null,null,null,null,0,0]
["Waste Water Treatment Works",null,null,null,null,null,null,null,null,0,0]
["Outfall Sewers",null,null,null,null,null,null,null,null,0,0]
["Toilet Facilities",null,null,null,null,null,null,null,null,0,0]
["Capital Spares",null,null,null,null,null,null,null,null,0,0]
["Solid Waste Infrastructure",null,{"$f":"SUM(C47:C53)","v":0},{"$f":"SUM(D47:D53)","v":0},0,0,0,0,0,0,0,0,0]
["Landfill Sites",null,null,null,null,null,null,null,null,0,0]
["Waste Transfer Stations",null,null,null,null,null,null,null,null,0,0]
["Waste Processing Facilities",null,null,null,null,null,null,null,null,0,0]
["Waste Drop-off Points",null,null,null,null,null,null,null,null,0,0]
["Waste Separation Facilities",null,null,null,null,null,null,null,null,0,0]
["Electricity Generation Facilities",null,null,null,null,null,null,null,null,0,0]
["Capital Spares",null,null,null,null,null,null,null,null,0,0]
["Rail Infrastructure",null,{"$f":"SUM(C55:C63)","v":0},{"$f":"SUM(D55:D63)","v":0},0,0,0,0,0,0,0,0,0]
["Rail Lines",null,null,null,null,null,null,null,null,0,0]
["Rail Structures",null,null,null,null,null,null,null,null,0,0]
["Rail Furniture",null,null,null,null,null,null,null,null,0,0]
["Drainage Collection",null,null,null,null,null,null,null,null,0,0]
["Storm water Conveyance",null,null,null,null,null,null,null,null,0,0]
["Attenuation",null,null,null,null,null,null,null,null,0,0]
["MV Substations",null,null,null,null,null,null,null,null,0,0]
["LV Networks",null,null,null,null,null,null,null,null,0,0]
["Capital Spares",null,null,null,null,null,null,null,null,0,0]
["Coastal Infrastructure",null,{"$f":"SUM(C65:C69)","v":0},0,0,0,0,0,0,0,0,0,0]
["Sand Pumps",null,null,null,null,null,null,null,null,0,0]
["Piers",null,null,null,null,null,null,null,null,0,0]
["Revetments",null,null,null,null,null,null,null,null,0,0]
["Promenades",null,null,null,null,null,null,null,null,0,0]
["Capital Spares",null,null,null,null,null,null,null,null,0,0]
["Information and Communication Infrastructure",null,{"$f":"SUM(C71:C74)","v":0},0,0,0,0,0,0,0,0,0,0]
["Data Centres",null,null,null,null,null,null,null,null,0,0]
["Core Layers",null,null,null,null,null,null,null,null,0,0]
["Distribution Layers",null,null,null,null,null,null,null,null,{"$f":"SUM(E73:I73)","v":0},{"$f":"IF(D73=0,C73+J73,D73+J73)","v":0}]
["Capital Spares",null,null,null,null,null,null,null,null,0,0]
[]
["Community Assets",null,{"$f":"+C77+C100","v":0},{"$f":"+D77+D100","v":0},{"$f":"+E77+E100","v":0},0,0,0,0,0,0,0,0]
["Community Facilities",null,{"$f":"SUM(C78:C99)","v":0},{"$f":"SUM(D78:D99)","v":0},{"$f":"SUM(E78:E99)","v":0},0,0,0,0,0,0,0,0]
["Halls",null,null,null,null,null,null,null,null,0,0]
["Centres",null,null,null,null,null,null,null,null,0,0]
["Crèches",null,null,null,null,null,null,null,null,0,0]
["Clinics/Care Centres",null,null,null,null,null,null,null,null,0,0]
["Fire/Ambulance Stations",null,null,null,null,null,null,null,null,0,0]
["Testing Stations",null,null,null,null,null,null,null,null,0,0]
["Museums",null,null,null,null,null,null,null,null,0,0]
["Galleries",null,null,null,null,null,null,null,null,0,0]
["Theatres",null,null,null,null,null,null,null,null,0,0]
["Libraries",null,null,null,null,null,null,null,null,0,0]
["Cemeteries/Crematoria",null,null,null,null,null,null,null,null,0,0]
["Police",null,null,null,null,null,null,null,null,0,0]
["Purls",null,null,null,null,null,null,null,null,0,0]
["Public Open Space",null,null,null,null,null,null,null,null,0,0]
["Nature Reserves",null,null,null,null,null,null,null,null,0,0]
["Public Ablution Facilities",null,null,null,null,null,null,null,null,0,0]
["Markets",null,null,null,null,null,null,null,null,0,0]
["Stalls",null,null,null,null,null,null,null,null,0,0]
["Abattoirs",null,null,null,null,null,null,null,null,0,0]
["Airports",null,null,null,null,null,null,null,null,0,0]
["Taxi Ranks/Bus Terminals",null,null,null,null,null,null,null,null,0,0]
["Capital Spares",null,null,null,null,null,null,null,null,0,0]
["Sport and Recreation Facilities",null,{"$f":"SUM(C101:C103)","v":0},{"$f":"SUM(D101:D103)","v":0},0,0,0,0,0,0,0,0,0]
["Indoor Facilities",null,null,null,null,null,null,null,null,0,0]
["Outdoor Facilities",null,null,null,null,null,null,null,null,0,0]
["Capital Spares",null,null,null,null,null,null,null,null,0,0]
[]
["Heritage assets",null,{"$f":"SUM(C106:C110)","v":0},0,0,0,0,0,0,0,0,0,0]
["Monuments",null,null,null,null,null,null,null,null,0,0]
["Historic Buildings",null,null,null,null,null,null,null,null,0,0]
["Works of Art",null,null,null,null,null,null,null,null,0,0]
["Conservation Areas",null,null,null,null,null,null,null,null,0,0]
["Other Heritage",null,null,null,null,null,null,null,null,0,0]
[]
["Investment properties",null,{"$f":"+C113+C116","v":0},{"$f":"+D113+D116","v":0},0,0,0,0,0,0,0,{"$f":"+L113+L116","v":0},{"$f":"+M113+M116","v":0}]
["Revenue Generating",null,{"$f":"SUM(C114:C115)","v":0},{"$f":"SUM(D114:D115)","v":0},0,0,0,0,0,0,0,{"$f":"SUM(L114:L115)","v":0},{"$f":"SUM(M114:M115)","v":0}]
["Improved Property",null,null,null,null,null,null,null,null,0,0]
["Unimproved Property",null,null,null,null,null,null,null,null,0,0]
["Non-revenue Generating",null,{"$f":"SUM(C117:C118)","v":0},{"$f":"SUM(D117:D118)","v":0},{"$f":"SUM(E117:E118)","v":0},0,0,0,0,0,0,0,0]
["Improved Property",null,null,null,null,null,null,null,null,0,0]
["Unimproved Property",null,null,null,null,null,null,null,null,0,0]
[]
["Other assets",null,{"$f":"+C121+C133","v":0},{"$f":"+D121+D133","v":0},0,0,0,0,0,0,0,{"$f":"+L121+L133","v":0},{"$f":"+M121+M133","v":0}]
["Operational Buildings",null,{"$f":"SUM(C122:C132)","v":0},{"$f":"SUM(D122:D132)","v":0},{"$f":"SUM(E122:E132)","v":0},0,0,0,0,0,0,0,0]
["Municipal Offices",null,null,null,null,null,null,null,null,0,0]
["Pay/Enquiry Points",null,null,null,null,null,null,null,null,0,0]
["Building Plan Offices",null,null,null,null,null,null,null,null,0,0]
["Workshops",null,null,null,null,null,null,null,null,0,0]
["Yards",null,null,null,null,null,null,null,null,0,0]
["Stores",null,null,null,null,null,null,null,null,0,0]
["Laboratories",null,null,null,null,null,null,null,null,0,0]
["Training Centres",null,null,null,null,null,null,null,null,0,0]
["Manufacturing Plant",null,null,null,null,null,null,null,null,0,0]
["Depots",null,null,null,null,null,null,null,null,0,0]
["Capital Spares",null,null,null,null,null,null,null,null,0,0]
["Housing",null,{"$f":"SUM(C134:C136)","v":0},{"$f":"SUM(D134:D136)","v":0},{"$f":"SUM(E134:E136)","v":0},0,0,0,0,0,0,0,0]
["Staff Housing",null,null,null,null,null,null,null,null,0,0]
["Social Housing",null,null,null,null,null,null,null,null,0,0]
["Capital Spares",null,null,null,null,null,null,null,null,0,0]
[]
["Biological or Cultivated Assets",null,{"$f":"SUM(C139:C139)","v":0},0,0,0,0,0,0,{"$f":"SUM(E138:I138)","v":0},{"$f":"IF(D138=0,C138+J138,D138+J138)","v":0},0,0]
["Biological or Cultivated Assets",null,null,null,null,null,null,null,null,0,0]
[]
["Intangible Assets",null,{"$f":"SUM(C142:C143)","v":0},{"$f":"SUM(D142:D143)","v":0},{"$f":"SUM(E142:E143)","v":0},0,0,0,0,0,0,0,0]
["Servitudes",null,null,null,null,null,null,null,null,0,0]
["Licences and Rights",null,{"$f":"SUM(C144:C149)","v":0},{"$f":"SUM(D144:D149)","v":0},{"$f":"SUM(E144:E149)","v":0},0,0,0,0,0,0,0,0]
["Water Rights",null,null,null,null,null,null,null,null,0,0]
["Effluent Licenses",null,null,null,null,null,null,null,null,0,0]
["Solid Waste Licenses",null,null,null,null,null,null,null,null,0,0]
["Computer Software and Applications",null,null,null,null,null,null,null,null,0,0]
["Load Settlement Software Applications",null,null,null,null,null,null,null,null,0,0]
["Unspecified",null,null,null,null,null,null,null,null,0,0]
[]
["Computer Equipment",null,{"$f":"SUM(C152:C152)","v":0},0,0,0,0,0,0,0,0,0,0]
["Computer Equipment",null,0,null,null,null,null,null,null,0,0]
[]
["Furniture and Office Equipment",null,{"$f":"SUM(C155:C155)","v":61452.152096399994},0,0,0,0,0,50000,50000,111452.15209639999,164770.56830960501,268332.94956663297]
["Furniture and Office Equipment",null,61452.152096399994,null,null,null,null,null,50000,50000,111452.15209639999,164770.56830960501,268332.94956663297]
[]
["Machinery and Equipment",null,{"$f":"SUM(C158:C158)","v":77587.684433799994},0,0,0,0,0,100000,100000,177587.68443379999,172577.41939322499,200000]
["Machinery and Equipment",null,77587.684433799994,null,null,null,null,null,100000,100000,177587.68443379999,172577.41939322499,200000]
[]
["Transport Assets",null,{"$f":"SUM(C161:C161)","v":75481.684433799994},0,0,0,0,0,100000,100000,175481.68443379999,170357.695393225,406327.36863985303]
["Transport Assets",null,75481.684433799994,null,null,null,null,null,100000,100000,175481.68443379999,170357.695393225,406327.36863985303]
[]
["Land",null,{"$f":"SUM(C164:C164)","v":0},0,0,0,0,0,0,0,0,0,0]
["Land",null,null,null,null,null,null,null,null,0,0]
[]
["Zoo's, Marine and Non-biological Animals",null,{"$f":"SUM(C167:C167)","v":0},0,0,0,0,0,0,0,0,0,0]
["Zoo's, Marine and Non-biological Animals",null,null,null,null,null,null,null,null,0,0]
[]
["Total Depreciation to be adjusted",1,{"$f":"C8+C76+C105+C112+C120+C151+C138+C141+C154+C157+C160+C163+C166","v":5043379.8119640006},{"$f":"D8+D76+D105+D112+D120+D151+D138+D141+D154+D157+D160+D163+D166","v":0},0,0,0,0,898831.77,898831.77,5942211.5819640011,6865247.6830960549,7311489.3182064854]
[{"$f":"head27a","v":"References"}]
["1. Total Repairs and Maintenance Expenditure by Asset Category must reconcile to total repairs and maintenance expenditure on Table SB1"]
["7. Only complete if a previous adjusted budget has been approved in the same financial year. Reflect most recent adjusted budget."]
["8. Additional cash-backed accumulated funds/unspent funds (section 18(1)(b) and section 28(2)(e) MFMA) identified after Original Budget approved and after annual financial statements audited (note: only where underspending could not reasonably be have for"]
["9. Increases of funds approved under section 31 MFMA"]
["10. Adjustments approved in accordance with section 29 MFMA"]
["11. Adjustments to funding allocations from National or Provincial Government"]
["12. Adjusts. = 'Other' Adjustments proposed to be approved; including revenue under-collection (MFMA section 28(2)(a)); additional revenue appropriation on existing programmes (section 28(2))(b); projected savings (section 28(2)(d)); error correction (sec"]
["13. G = B + C + D + E + F"]
["14. Adjusted Budget H = (A or A1/2 etc) + G"]
[]
[]
["check balance",null,{"$f":"C169-'B4-FinPerf RE'!C29","v":1.9640009850263596E-3},null,null,null,null,null,null,null,null,{"$f":"L169-'B4-FinPerf RE'!L29","v":-0.31690394505858421},{"$f":"M169-'B4-FinPerf RE'!M29","v":0.31820648536086082}]

{"sheet":"SB18e","index":40,"n_rows":183,"n_cols":13,"rows_kept":183,"cut":false,"hidden":false,"merged":[[175,0,175,12],[177,0,177,12],[179,0,179,12],[1,0,3,0],[1,1,3,1],[1,2,1,10],[172,0,172,12],[173,0,173,9],[174,0,174,9]]}
[{"$f":"muni&\" - \"&ADJB18e&\" - \"&Date","v":"LIM332 Greater Letaba - Adjustments Budget - capital expenditure on upgrading of existing assets by asset class - 27 February 2019"}]
[{"$f":"desc","v":"Description"},{"$f":"head27","v":"Ref"},{"$f":"Head2","v":"Budget Year 2018/19"},null,null,null,null,null,null,null,null,{"$f":"Head10","v":"Budget Year +1 2019/20"},{"$f":"Head11","v":"Budget Year +2 2020/21"}]
[null,null,{"$f":"Head6","v":"Original Budget"},{"$f":"Head54","v":"Prior Adjusted"},{"$f":"Head51","v":"Accum. Funds"},{"$f":"Head52","v":"Multi-year capital"},{"$f":"Head53","v":"Unfore. Unavoid."},{"$f":"Head55","v":"Nat. or Prov. Govt"},{"$f":"Head50","v":"Other Adjusts."},{"$f":"Head56","v":"Total Adjusts."},{"$f":"Head7","v":"Adjusted Budget"},{"$f":"Head7","v":"Adjusted Budget"},{"$f":"Head7","v":"Adjusted Budget"}]
[null,null,null,7,8,9,10,11,12,13,14]
["R thousands",null,"A","A1","B","C","D","E","F","G","H"]
["Capital expenditure on upgrading of existing assets by Asset Class/Sub-class"]
[]
["Infrastructure",null,{"$f":"C9+C14+C18+C28+C70+C39+C46+C54+C64","v":0},{"$f":"D9+D14+D18+D28+D70+D39+D46+D54+D64","v":0},0,0,0,0,0,{"$f":"SUM(E8:I8)","v":0},{"$f":"IF(D8=0,C8+J8,D8+J8)","v":0},{"$f":"L9+L14+L18+L28+L70+L39+L46+L54+L64","v":0},{"$f":"M9+M14+M18+M28+M70+M39+M46+M54+M64","v":0}]
["Roads Infrastructure",null,{"$f":"SUM(C10:C13)","v":0},{"$f":"SUM(D10:D13)","v":0},0,0,0,0,0,{"$f":"SUM(E9:I9)","v":0},{"$f":"IF(D9=0,C9+J9,D9+J9)","v":0},0,0]
["Roads",null,null,null,null,null,null,null,null,0,0]
["Road Structures",null,null,null,null,null,null,null,null,0,0]
["Road Furniture",null,null,null,null,null,null,null,null,0,0]
["Capital Spares",null,null,null,null,null,null,null,null,0,0]
["Storm water Infrastructure",null,{"$f":"SUM(C15:C17)","v":0},0,0,0,0,0,0,0,0,{"$f":"SUM(L15:L17)","v":0},{"$f":"SUM(M15:M17)","v":0}]
["Drainage Collection",null,null,null,null,null,null,null,null,0,0]
["Storm water Conveyance",null,null,null,null,null,null,null,null,0,0]
["Attenuation",null,null,null,null,null,null,null,null,0,0]
["Electrical Infrastructure",null,{"$f":"SUM(C19:C27)","v":0},0,0,0,0,0,0,0,0,0,0]
["Power Plants",null,null,null,null,null,null,null,null,0,0]
["HV Substations",null,null,null,null,null,null,null,null,0,0]
["HV Switching Station",null,null,null,null,null,null,null,null,0,0]
["HV Transmission Conductors",null,null,null,null,null,null,null,null,0,0]
["MV Substations",null,null,null,null,null,null,null,null,0,0]
["MV Switching Stations",null,null,null,null,null,null,null,null,0,0]
["MV Networks",null,null,null,null,null,null,null,null,0,0]
["LV Networks",null,null,null,null,null,null,null,null,0,0]
["Capital Spares",null,null,null,null,null,null,null,null,0,0]
["Water Supply Infrastructure",null,{"$f":"SUM(C29:C38)","v":0},0,0,0,0,0,0,0,0,0,0]
["Dams and Weirs",null,null,null,null,null,null,null,null,0,0]
["Boreholes",null,null,null,null,null,null,null,null,0,0]
["Reservoirs",null,null,null,null,null,null,null,null,0,0]
["Pump Stations",null,null,null,null,null,null,null,null,0,0]
["Water Treatment Works",null,null,null,null,null,null,null,null,0,0]
["Bulk Mains",null,null,null,null,null,null,null,null,0,0]
["Distribution",null,null,null,null,null,null,null,null,0,0]
["Distribution Points",null,null,null,null,null,null,null,null,0,0]
["PRV Stations",null,null,null,null,null,null,null,null,0,0]
["Capital Spares",null,null,null,null,null,null,null,null,0,0]
["Sanitation Infrastructure",null,{"$f":"SUM(C40:C45)","v":0},{"$f":"SUM(D40:D45)","v":0},0,0,0,0,0,0,0,0,0]
["Pump Station",null,null,null,null,null,null,null,null,0,0]
["Reticulation",null,null,null,null,null,null,null,null,0,0]
["Waste Water Treatment Works",null,null,null,null,null,null,null,null,0,0]
["Outfall Sewers",null,null,null,null,null,null,null,null,0,0]
["Toilet Facilities",null,null,null,null,null,null,null,null,0,0]
["Capital Spares",null,null,null,null,null,null,null,null,0,0]
["Solid Waste Infrastructure",null,{"$f":"SUM(C47:C53)","v":0},{"$f":"SUM(D47:D53)","v":0},0,0,0,0,0,0,0,0,0]
["Landfill Sites",null,null,null,null,null,null,null,null,0,0]
["Waste Transfer Stations",null,null,null,null,null,null,null,null,0,0]
["Waste Processing Facilities",null,null,null,null,null,null,null,null,0,0]
["Waste Drop-off Points",null,null,null,null,null,null,null,null,0,0]
["Waste Separation Facilities",null,null,null,null,null,null,null,null,0,0]
["Electricity Generation Facilities",null,null,null,null,null,null,null,null,0,0]
["Capital Spares",null,null,null,null,null,null,null,null,0,0]
["Rail Infrastructure",null,{"$f":"SUM(C55:C63)","v":0},{"$f":"SUM(D55:D63)","v":0},0,0,0,0,0,0,0,0,0]
["Rail Lines",null,null,null,null,null,null,null,null,0,0]
["Rail Structures",null,null,null,null,null,null,null,null,0,0]
["Rail Furniture",null,null,null,null,null,null,null,null,0,0]
["Drainage Collection",null,null,null,null,null,null,null,null,0,0]
["Storm water Conveyance",null,null,null,null,null,null,null,null,0,0]
["Attenuation",null,null,null,null,null,null,null,null,0,0]
["MV Substations",null,null,null,null,null,null,null,null,0,0]
["LV Networks",null,null,null,null,null,null,null,null,0,0]
["Capital Spares",null,null,null,null,null,null,null,null,0,0]
["Coastal Infrastructure",null,{"$f":"SUM(C65:C69)","v":0},0,0,0,0,0,0,0,0,0,0]
["Sand Pumps",null,null,null,null,null,null,null,null,0,0]
["Piers",null,null,null,null,null,null,null,null,0,0]
["Revetments",null,null,null,null,null,null,null,null,0,0]
["Promenades",null,null,null,null,null,null,null,null,0,0]
["Capital Spares",null,null,null,null,null,null,null,null,0,0]
["Information and Communication Infrastructure",null,{"$f":"SUM(C71:C74)","v":0},0,0,0,0,0,0,0,0,0,0]
["Data Centres",null,null,null,null,null,null,null,null,0,0]
["Core Layers",null,null,null,null,null,null,null,null,0,0]
["Distribution Layers",null,null,null,null,null,null,null,null,{"$f":"SUM(E73:I73)","v":0},{"$f":"IF(D73=0,C73+J73,D73+J73)","v":0}]
["Capital Spares",null,null,null,null,null,null,null,null,0,0]
[]
["Community Assets",null,{"$f":"+C77+C100","v":0},{"$f":"+D77+D100","v":0},{"$f":"+E77+E100","v":0},0,0,0,0,0,0,0,0]
["Community Facilities",null,{"$f":"SUM(C78:C99)","v":0},{"$f":"SUM(D78:D99)","v":0},{"$f":"SUM(E78:E99)","v":0},0,0,0,0,0,0,0,0]
["Halls",null,null,null,null,null,null,null,null,0,0]
["Centres",null,null,null,null,null,null,null,null,0,0]
["Crèches",null,null,null,null,null,null,null,null,0,0]
["Clinics/Care Centres",null,null,null,null,null,null,null,null,0,0]
["Fire/Ambulance Stations",null,null,null,null,null,null,null,null,0,0]
["Testing Stations",null,null,null,null,null,null,null,null,0,0]
["Museums",null,null,null,null,null,null,null,null,0,0]
["Galleries",null,null,null,null,null,null,null,null,0,0]
["Theatres",null,null,null,null,null,null,null,null,0,0]
["Libraries",null,null,null,null,null,null,null,null,0,0]
["Cemeteries/Crematoria",null,null,null,null,null,null,null,null,0,0]
["Police",null,null,null,null,null,null,null,null,0,0]
["Purls",null,null,null,null,null,null,null,null,0,0]
["Public Open Space",null,null,null,null,null,null,null,null,0,0]
["Nature Reserves",null,null,null,null,null,null,null,null,0,0]
["Public Ablution Facilities",null,null,null,null,null,null,null,null,0,0]
["Markets",null,null,null,null,null,null,null,null,0,0]
["Stalls",null,null,null,null,null,null,null,null,0,0]
["Abattoirs",null,null,null,null,null,null,null,null,0,0]
["Airports",null,null,null,null,null,null,null,null,0,0]
["Taxi Ranks/Bus Terminals",null,null,null,null,null,null,null,null,0,0]
["Capital Spares",null,null,null,null,null,null,null,null,0,0]
["Sport and Recreation Facilities",null,{"$f":"SUM(C101:C103)","v":0},{"$f":"SUM(D101:D103)","v":0},0,0,0,0,0,0,0,0,0]
["Indoor Facilities",null,null,null,null,null,null,null,null,0,0]
["Outdoor Facilities",null,null,null,null,null,null,null,null,0,0]
["Capital Spares",null,null,null,null,null,null,null,null,0,0]
[]
["Heritage assets",null,{"$f":"SUM(C106:C110)","v":0},0,0,0,0,0,0,0,0,0,0]
["Monuments",null,null,null,null,null,null,null,null,0,0]
["Historic Buildings",null,null,null,null,null,null,null,null,0,0]
["Works of Art",null,null,null,null,null,null,null,null,0,0]
["Conservation Areas",null,null,null,null,null,null,null,null,0,0]
["Other Heritage",null,null,null,null,null,null,null,null,0,0]
[]
["Investment properties",null,{"$f":"+C113+C116","v":0},{"$f":"+D113+D116","v":0},0,0,0,0,0,0,0,{"$f":"+L113+L116","v":0},{"$f":"+M113+M116","v":0}]
["Revenue Generating",null,{"$f":"SUM(C114:C115)","v":0},{"$f":"SUM(D114:D115)","v":0},{"$f":"SUM(E114:E115)","v":0},0,0,0,0,0,0,0,0]
["Improved Property",null,null,null,null,null,null,null,null,0,0]
["Unimproved Property",null,null,null,null,null,null,null,null,0,0]
["Non-revenue Generating",null,{"$f":"SUM(C117:C118)","v":0},{"$f":"SUM(D117:D118)","v":0},{"$f":"SUM(E117:E118)","v":0},0,0,0,0,0,0,0,0]
["Improved Property",null,null,null,null,null,null,null,null,0,0]
["Unimproved Property",null,null,null,null,null,null,null,null,0,0]
[]
["Other assets",null,{"$f":"+C121+C133","v":0},{"$f":"+D121+D133","v":0},0,0,0,0,0,0,0,{"$f":"+L121+L133","v":0},{"$f":"+M121+M133","v":0}]
["Operational Buildings",null,{"$f":"SUM(C122:C132)","v":0},{"$f":"SUM(D122:D132)","v":0},0,0,0,0,0,0,0,{"$f":"SUM(L122:L132)","v":0},{"$f":"SUM(M122:M132)","v":0}]
["Municipal Offices",null,null,null,null,null,null,null,null,0,0]
["Pay/Enquiry Points",null,null,null,null,null,null,null,null,0,0]
["Building Plan Offices",null,null,null,null,null,null,null,null,0,0]
["Workshops",null,null,null,null,null,null,null,null,0,0]
["Yards",null,null,null,null,null,null,null,null,0,0]
["Stores",null,null,null,null,null,null,null,null,0,0]
["Laboratories",null,null,null,null,null,null,null,null,0,0]
["Training Centres",null,null,null,null,null,null,null,null,0,0]
["Manufacturing Plant",null,null,null,null,null,null,null,null,0,0]
["Depots",null,null,null,null,null,null,null,null,0,0]
["Capital Spares",null,null,null,null,null,null,null,null,0,0]
["Housing",null,{"$f":"SUM(C134:C136)","v":0},{"$f":"SUM(D134:D136)","v":0},{"$f":"SUM(E134:E136)","v":0},0,0,0,0,0,0,0,0]
["Staff Housing",null,null,null,null,null,null,null,null,0,0]
["Social Housing",null,null,null,null,null,null,null,null,0,0]
["Capital Spares",null,null,null,null,null,null,null,null,0,0]
[]
["Biological or Cultivated Assets",null,{"$f":"SUM(C139:C139)","v":0},0,0,0,0,0,0,{"$f":"SUM(E138:I138)","v":0},{"$f":"IF(D138=0,C138+J138,D138+J138)","v":0},0,0]
["Biological or Cultivated Assets",null,null,null,null,null,null,null,null,0,0]
[]
["Intangible Assets",null,{"$f":"SUM(C142:C143)","v":0},{"$f":"SUM(D142:D143)","v":0},{"$f":"SUM(E142:E143)","v":0},0,0,0,0,0,0,0,0]
["Servitudes",null,null,null,null,null,null,null,null,0,0]
["Licences and Rights",null,{"$f":"SUM(C144:C149)","v":0},{"$f":"SUM(D144:D149)","v":0},{"$f":"SUM(E144:E149)","v":0},0,0,0,0,0,0,0,0]
["Water Rights",null,null,null,null,null,null,null,null,0,0]
["Effluent Licenses",null,null,null,null,null,null,null,null,0,0]
["Solid Waste Licenses",null,null,null,null,null,null,null,null,0,0]
["Computer Software and Applications",null,null,null,null,null,null,null,null,0,0]
["Load Settlement Software Applications",null,null,null,null,null,null,null,null,0,0]
["Unspecified",null,null,null,null,null,null,null,null,0,0]
[]
["Computer Equipment",null,{"$f":"SUM(C152:C152)","v":0},0,0,0,0,0,0,0,0,0,0]
["Computer Equipment",null,null,null,null,null,null,null,null,0,0]
[]
["Furniture and Office Equipment",null,{"$f":"SUM(C155:C155)","v":0},0,0,0,0,0,0,0,0,0,0]
["Furniture and Office Equipment",null,null,null,null,null,null,null,null,0,0]
[]
["Machinery and Equipment",null,{"$f":"SUM(C158:C158)","v":0},0,0,0,0,0,0,0,0,0,0]
["Machinery and Equipment",null,null,null,null,null,null,null,null,0,0]
[]
["Transport Assets",null,{"$f":"SUM(C161:C161)","v":0},0,0,0,0,0,0,0,0,0,0]
["Transport Assets",null,null,null,null,null,null,null,null,0,0]
[]
["Land",null,{"$f":"SUM(C164:C164)","v":0},0,0,0,0,0,0,0,0,0,0]
["Land",null,null,null,null,null,null,null,null,0,0]
[]
["Zoo's, Marine and Non-biological Animals",null,{"$f":"SUM(C167:C167)","v":0},0,0,0,0,0,0,0,0,0,0]
["Zoo's, Marine and Non-biological Animals",null,null,null,null,null,null,null,null,0,0]
[]
["Total Capital Expenditure on upgrading of existing assets to be adjusted",1,{"$f":"C8+C76+C105+C112+C120+C151+C138+C141+C154+C157+C160+C163+C166","v":0},{"$f":"D8+D76+D105+D112+D120+D151+D138+D141+D154+D157+D160+D163+D166","v":0},0,0,0,0,0,0,0,0,0]
[]
[{"$f":"head27a","v":"References"}]
["1. Total Capital Expenditure  on renewal of existing assets (SB18b) plus Total Capital Expenditure on new assets (SB18a) plus Total Capital Expenditure on upgrading of existing assets (SB18e) must reconcile to total capital expenditure in Budgeted Capital Expenditure"]
["7. Only complete if a previous adjusted budget has been approved in the same financial year. Reflect most recent adjusted budget."]
["8. Additional cash-backed accumulated funds/unspent funds (section 18(1)(b) and section 28(2)(e) MFMA) identified after Original Budget approved and after annual financial statements audited (note: only where underspending could not reasonably be have for"]
["9. Increases of funds approved under section 31 MFMA"]
["10. Adjustments approved in accordance with section 29 MFMA"]
["11. Adjustments to funding allocations from National or Provincial Government"]
["12. Adjusts. = 'Other' Adjustments proposed to be approved; including revenue under-collection (MFMA section 28(2)(a)); additional revenue appropriation on existing programmes (section 28(2))(b); projected savings (section 28(2)(d)); error correction (sec"]
["13. G = B + C + D + E + F"]
["14. Adjusted Budget H = (A or A1/2 etc) + G"]
[]
[]
["check balance",null,{"$f":"(C169+SB18a!C169+SB18b!C169)-'B5-Capex'!C65","v":-1000.0000000298023},null,null,null,null,null,null,null,null,{"$f":"(L169+SB18a!L169+SB18b!L169)-'B5-Capex'!L65","v":0},{"$f":"(M169+SB18a!M169+SB18b!M169)-'B5-Capex'!M65","v":0}]

{"sheet":"SB19","index":41,"n_rows":340,"n_cols":18,"rows_kept":340,"cut":false,"hidden":false,"merged":[[1,12,1,17],[2,12,2,13],[2,14,2,15],[2,16,2,17]]}
[{"$f":"muni&\" - \"&ADJB19&\" - \"&Date","v":"LIM332 Greater Letaba - Supporting Table SB19 List of capital programmes and projects affected by Adjustments Budget - 27 February 2019"}]
["Function","Project Description","Project Number","Type","MTSF Service Outcome","IUDF","Own Strategic Objectives","Asset Class","Asset Sub-Class ","Ward Location","GPS Longitude","GPS Lattitude",{"$f":"Head3a","v":"Medium Term Revenue and Expenditure Framework"}]
[null,null,null,null,null,null,null,null,null,null,null,null,{"$f":"Head9","v":"Budget Year 2018/19"},null,{"$f":"Head10","v":"Budget Year +1 2019/20"},null,{"$f":"Head11","v":"Budget Year +2 2020/21"}]
["R thousands",null,null,null,null,null,null,null,null,null,null,null,{"$f":"Head6","v":"Original Budget"},{"$f":"Head7","v":"Adjusted Budget"},{"$f":"Head6","v":"Original Budget"},{"$f":"Head7","v":"Adjusted Budget"},{"$f":"Head6","v":"Original Budget"},{"$f":"Head7","v":"Adjusted Budget"}]
["Parent municipality:"]
["List all capital projects grouped by Function"]
[]
["Mayor' s Office","Council vehicles (Mayor)",null,"New",null,null,null,"Transport Assets","Capital Spares",29,null,null,0]
[null,"Council vehicles (Speaker)",null,"New",null,null,null,"Transport Assets","Capital Spares",29,null,null,0]
[null,"Scanner",null,"New",null,null,null,"Furniture and Office Equipment","Municipal Offices",29,null,null,0]
[null,"Banners",null,"New",null,null,null,"Furniture and Office Equipment","Municipal Offices",29,null,null,0]
[null,"2* Podiums",null,"New",null,null,null,"Furniture and Office Equipment","Municipal Offices",29,null,null,0]
[null,"Recording machine: Imbizo & Corporate",null,"New",null,null,null,"Machinery and Equipment","Municipal Offices",29,null,null,0]
[null,"Interior decoration: Reception ",null,"New",null,null,null,"Operational Buildings","Municipal Offices",29,null,null,0]
[]
["Budget and Treasury Office","Large lockable cash boxes (6)",null,"New",null,null,null,"Furniture and Office Equipment","Municipal Offices",29,null,null,0]
[null,"Lockable cashiers tills *8 (Finance and Traffic)",null,"New",null,null,null,"Furniture and Office Equipment","Municipal Offices",29,null,null,50000,null,0,50000]
[null,"Small safe for Cashiers",null,"New",null,null,null,"Furniture and Office Equipment","Municipal Offices",29,null,null,30000,null,0,30000]
[null,"New tanks,pumps and shades",null,"New",null,null,null,"Machinery and Equipment","Municipal Offices",29,null,null,0]
[null,"Printers (4) Revenue, Asset, SCM",null,"New",null,null,null,"Furniture and Office Equipment","Municipal Offices",29,null,null,0]
[null,"Fencing of Municipal Workshop",null,"New",null,null,null,"Furniture and Office Equipment","Municipal Offices",29,null,null,0]
[null,"Printer all in one Fax,Scan & Print (Budget office)",null,"New",null,null,null,"Furniture and Office Equipment","Municipal Offices",29,null,null,0]
[null,"Adcanced Scanner (huge mega bytes)",null,"New",null,null,null,"Furniture and Office Equipment","Municipal Offices",29,null,null,0]
[null,"Slip Printers (4)",null,"New",null,null,null,"Furniture and Office Equipment","Municipal Offices",29,null,null,0]
[null,"Money note Counter with detector *4 (Finance and Traffic)",null,"New",null,null,null,"Furniture and Office Equipment","Municipal Offices",29,null,null,50000]
[null,"GIS System",null,"New",null,null,null,"Licences and Rights","Municipal Offices",29,null,null,0]
[null,"Steel cabinets *10 (Finance Offices)",null,"New",null,null,null,"Furniture and Office Equipment","Municipal Offices",29,null,null,50000]
[null,"Installation of cameras in stores room",null,"New",null,null,null,"Machinery and Equipment","Municipal Offices",29,null,null,50000]
[null,"Fleet Management system - Tracking device",null,"New",null,null,null,"Licences and Rights","Municipal Offices",29,null,null,400000]
[null,"Refurbishment of room for lubricants outside warehouse",null,"New",null,null,null,"Operational Buildings","Municipal Offices",29,null,null,100000]
[null,"Scanner",null,"New",null,null,null,"Furniture and Office Equipment","Municipal Offices",29,null,null,0]
[]
["Human Resources","Office Furniture",null,"New",null,null,null,"Furniture and Office Equipment","Municipal Offices",29,null,null,1300000]
[]
["Information Technology","Mobile Overhead Projector (2)",null,"New",null,null,null,"Furniture and Office Equipment","Municipal Offices",29,null,null,0]
[null,"Overhead projectors celling",null,"New",null,null,null,"Furniture and Office Equipment","Municipal Offices",29,null,null,0]
[null,"Records Management and Archiving system",null,"New",null,null,null,"Furniture and Office Equipment","Municipal Offices",29,null,null,800000]
[null,"Laptops  (15)",null,"New",null,null,null,"Computer Equipment","Municipal Offices",29,null,null,180000,null,200000,200000]
[null,"Desktop PC (20)",null,"New",null,null,null,"Computer Equipment","Municipal Offices",29,null,null,200000,null,150000,150000]
[null,"Uniterupted Power Supply (UPS)",null,"New",null,null,null,"Computer Equipment","Municipal Offices",29]
[null,"UPS - Finance PC",null,"New",null,null,null,"Computer Equipment","Municipal Offices",29]
[null,"Tablets for Councillors (60 contract)",null,"New",null,null,null,"Computer Equipment","Municipal Offices",29]
[null,"Automated PMS System",null,"New",null,null,null,"Computer Equipment","Municipal Offices",29]
[null,"Suprema - Pre Pair System",null,"New",null,null,null,"Computer Equipment","Municipal Offices",29]
[null,"SAFE - Data Centre ICT Tool Box Kit",null,"New",null,null,null,"Computer Equipment","Municipal Offices",29]
[null,"Scanner 1 - High Volume Registry System",null,"New",null,null,null,"Furniture and Office Equipment","Municipal Offices",29]
[null,"Slip Printers - sub Office",null,"New",null,null,null,"Furniture and Office Equipment","Municipal Offices",29,null,null,16000]
[null,"Brail note",null,"New",null,null,null,"Furniture and Office Equipment","Municipal Offices",29]
[null,"Share Point -Work Flow for Microsoft applications",null,"New",null,null,null,"Furniture and Office Equipment","Municipal Offices",29,null,null,0]
[null,"Civil designer Software (Allicad Software)",null,"New",null,null,null,"Furniture and Office Equipment","Municipal Offices",29,null,null,0]
[null,"Portable Notetaker",null,"New",null,null,null,"Furniture and Office Equipment","Municipal Offices",29,null,null,0]
[null,"ICT Call System software",null,"New",null,null,null,"Computer Equipment","Municipal Offices",29,null,null,250000]
[null,"Fire proof server room door",null,"New",null,null,null,"Operational Buildings","Municipal Offices",29]
[null,"Server Replacements",null,"New",null,null,null,"Licences and Rights","Municipal Offices",29]
[null,"Telephone Upgrade",null,"New",null,null,null,"Furniture and Office Equipment","Municipal Offices",29]
[null,"Org Plus Professional",null,"New",null,null,null,"Furniture and Office Equipment","Municipal Offices",29]
[null,"3 Overhead Projector ( Mayors, Mokwakwaila & Senwamokgope)",null,"New",null,null,null,"Furniture and Office Equipment","Municipal Offices","               29,27,13"]
[null,"PDF Converter Software",null,"New",null,null,null,"Furniture and Office Equipment","Municipal Offices",29]
[null,"Airconditioner (2 Server room)",null,"New",null,null,null,"Furniture and Office Equipment","Municipal Offices",29]
[null,"Blade Server Units",null,"New",null,null,null,"Furniture and Office Equipment","Municipal Offices",29]
[]
["Property Services","Bakkies  (3) sub-offices",null,"New",null,null,null,"Transport Assets","Municipal Offices",29,null,null,600000]
[null,"Rehibilitation of rotaba Cottages",null,"New",null,null,null,"Operational Buildings","Municipal Offices",29,null,null,1000000]
[null,"Air Condiioners (4) (Senwamokgope sub office)",null,"New",null,null,null,"Furniture and Office Equipment","Municipal Offices",13]
[null,"Vehicles (2) for registry & senwamokgope",null,"New",null,null,null,"Transport Assets","Municipal Offices",13]
[null,"Refrigirator *3",null,"New",null,null,null,"Furniture and Office Equipment","Municipal Offices",29]
[null,"Cashpower System",null,"New",null,null,null,"Furniture and Office Equipment","Municipal Offices",29]
[null,"Air Condiioner at Ga-Kgapane Licencing office)",null,"New",null,null,null,"Furniture and Office Equipment","Municipal Offices","                   03,04",null,null,150000]
[null,"Call Log System",null,"New",null,null,null,"Furniture and Office Equipment","Municipal Offices",29]
[null,"Mobile Filling Unit (2)",null,"New",null,null,null,"Furniture and Office Equipment","Municipal Offices",29,null,null,200000,null,0,200000]
[null,"Foyer to the main entrance interior design (Resistry & Corps)",null,"New",null,null,null,"Furniture and Office Equipment","Municipal Offices",29]
[null,"Counter and security buglar(registry)",null,"New",null,null,null,"Furniture and Office Equipment","Municipal Offices",29,null,null,15000]
[null,"Aqua cooler (3)",null,"New",null,null,null,"Furniture and Office Equipment","Municipal Offices",29]
[null,"Microwave *3",null,"New",null,null,null,"Furniture and Office Equipment","Municipal Offices",29]
[null,"Shredding machine (2)  (Corporate & Kgapane sub office)",null,"New",null,null,null,"Furniture and Office Equipment","Municipal Offices","29/27",null,null,0]
[null,"Blinds for windows",null,"New",null,null,null,"Furniture and Office Equipment","Municipal Offices",29,null,null,0]
[null,"Suggestion Boxes (4)",null,"New",null,null,null,"Furniture and Office Equipment","Municipal Offices",29,null,null,15000]
[null,"Banners Bathopele (4)",null,"New",null,null,null,"Furniture and Office Equipment","Municipal Offices",29,null,null,0]
[null,"Renovation of Mokwakwaila Sub Office",null,"New",null,null,null,"Operational Buildings","Municipal Offices",27,null,null,0]
[null,"Refurbishment of Municipal Workshop and stores",null,"New",null,null,null,"Operational Buildings","Municipal Offices",29,null,null,0]
[null,"Picture Camera",null,"New",null,null,null,"Furniture and Office Equipment","Municipal Offices",29]
[null,"Steel cabinets (Sub offices)",null,"New",null,null,null,"Furniture and Office Equipment","Municipal Offices",29,null,null,10000]
[null,"Sliding steel gate (Kgapane sub-office)",null,"New",null,null,null,"Operational Buildings","Municipal Offices",4,null,null,20000]
[null,"Steel Fence & gate (Senwamokgope)",null,"New",null,null,null,"Operational Buildings","Municipal Offices",13,null,null,200000]
[null,"Renovation of registry & Corporate service roof",null,"New",null,null,null,"Operational Buildings","Municipal Offices",29]
[null,"Urns (Mokwakwaila & kgapane)",null,"New",null,null,null,"Furniture and Office Equipment","Municipal Offices","              27,03,0,4"]
[null,"Picture Camera",null,"New",null,null,null,"Furniture and Office Equipment","Municipal Offices",29,null,null,0]
[null,"Refurbishment of corporate service offices, toilets, kitchen & registry",null,"New",null,null,null,"Operational Buildings","Municipal Offices",29,null,null,600000,null,0,600000]
[null,"Refurbishment of Mokwakwaila sub offices, toilets & kitchen",null,"New",null,null,null,"Operational Buildings","Municipal Offices",27,null,null,0]
[null,"Upgrading of municipal Offices",null,null,null,null,null,null,null,29,null,null,800000,null,0,800000]
[null,"Notice boards",null,"New",null,null,null,"Furniture and Office Equipment","Municipal Offices",29,null,null,0]
[]
["Planning and Development","GLM Show Ground",null,null,null,null,null,"Sport and Recreation Facilities","Outdoor Facilities",29]
[null,"Madumeleng Youth Information Centre (Planning)",null,null,null,null,null,"Community Facilities","Centres",1]
[null,"Maphalle Youth Information Centre (Planning)",null,null,null,null,null,"Community Facilities","Centres",20]
[null,"Planning(Quantity Surveyor)",null,null,null,null,null,"Housing","Capital Spares"]
[null,"Outdoor adverts (Electronic billboards (x2)",null,null,null,null,null,"Machinery and Equipment","Capital Spares",null,null,null,0]
[null,"Panarama Stand Development",null,null,null,null,null,"Housing","Capital Spares",29]
[null,"Modjadjiskloof Houses",null,null,null,null,null,"Housing","Capital Spares",29]
[null,"Urban Renewal",null,null,null,null,null,"Housing","Capital Spares",29]
[]
["Libraries & Archieves","Shotong Library",null,"New",null,null,null,"Community Facilities","Libraries",6,null,null,1118446.3999999999]
[null,"Rotterdam Library",null,"New",null,null,null,"Community Facilities","Libraries",16,null,null,500000,null,3000000,800000,4500000,3000000]
[]
["Community Halls & Facilities","New community hall - Rotterdam",null,null,null,null,null,"Community Facilities","Halls",16,null,null,0]
[null,"Chairs (2000) Tables (10) for Mokwakwaila & Senwamokgope Halls",null,null,null,null,null,"Community Facilities","Capital Spares","                   27,13",null,null,0]
[null,"Ward 2 Community Hall",null,"Renewal",null,null,null,"Community Facilities","Halls",2,null,null,0]
[null,"Ward 5 Community Hall ",null,"Renewal",null,null,null,"Community Facilities","Halls",5,null,null,600000,null,5700000,800000,1500000,1500000]
[null,"Matswi Community hall",null,"Renewal",null,null,null,"Community Facilities","Halls",11,null,null,0]
[null,"Mohlele community hall",null,"Renewal",null,null,null,"Community Facilities","Halls",26,null,null,0]
[null,"Mamaila-Kolobetona Community Hall",null,"Renewal",null,null,null,"Community Facilities","Halls",17,null,null,0]
[null,"Shamfana Community Hall (Construction)",null,"Renewal",null,null,null,"Community Facilities","Halls",25,null,null,0,null,2000000,null,1500000]
[null,"Lemondokop Community Hall",null,"New",null,null,null,"Community Facilities","Halls",18,null,null,600000,null,5700000,800000,1500000,1500000]
[null,"Tlotlokwe Community Hall (Planning)",null,"New",null,null,null,"Community Facilities","Halls",27,null,null,400000,null,5700000,800000,1500000,1500000]
[]
["Community & Social Services/Cemetries","Ga-Kgapane new cemetery establishment",null,"Renewal",null,null,null,"Community Facilities","Cemeteries/Crematoria","Ward3 /4",null,null,400000]
[]
["Disaster Management","Fire Extinguishers",null,"New",null,null,null,"Operational Buildings","Capital Spares",29,null,null,0]
[]
["Street Lighting","Streetlight cherry Picker ",null,"New",null,null,null,"Electrical Infrastructure","Capital Spares",29,null,null,1200000]
[null,"Highmast Lights in 10 Villages(Remaining two villages : Rampepe and Mamatlepa)",null,"New",null,null,null,"Electrical Infrastructure","Capital Spares","                   27/26",null,null,0,null,null,2000000,null,4500000]
[null,"Highmast in Various Villages",null,"New",null,null,null,"Electrical Infrastructure","Capital Spares",null,null,null,3000000,null,3500000,12000000,18169698,18169000]
[]
["Sports & Recreation","Drive on Lawnmover",null,"New",null,null,null,"Machinery and Equipment","Capital Spares",29,null,null,0]
[null,"Enhancement & Beautifications of town entrance",null,"New",null,null,null,"Community Facilities","Capital Spares",29,null,null,0]
[null,"Mamanyoha Sports Complex",null,"Renewal",null,null,null,"Sport and Recreation Facilities","Outdoor Facilities",27,null,null,13050771,null,13902226,10902226]
[null,"Madumeleng/Shotong Sports Complex",null,"Renewal",null,null,null,"Sport and Recreation Facilities","Outdoor Facilities",1,null,null,0]
[null,"Thakgalane Sports Complex",null,"Renewal",null,null,null,"Sport and Recreation Facilities","Outdoor Facilities",12,null,null,0]
[null,"Rotterdam Sports Complex",null,"Renewal",null,null,null,"Sport and Recreation Facilities","Outdoor Facilities",28,null,null,11884803,null,10000000,4500000,0]
[null,"Sekgopo Youth Centre",null,"Renewal",null,null,null,"Community Facilities","Indoor Facilities",9,null,null,0]
[null,"Kgapane Youth Centre",null,"Renewal",null,null,null,"Community Facilities","Indoor Facilities","03,04",null,null,0]
[null,"Roerfontein Youth Centre",null,"Renewal",null,null,null,"Community Facilities","Indoor Facilities",18,null,null,0]
[null,"Mokwakwaila Youth Centre",null,"New",null,null,null,"Community Facilities","Indoor Facilities",27,null,null,0]
[null,"Madumeleng Old Age Facility",null,"New",null,null,null,"Community Facilities","Indoor Facilities",1,null,null,0]
[null,"Kgapane Old Age Facility",null,"Renewal",null,null,null,"Community Facilities","Indoor Facilities","03,04",null,null,0]
[null,"Roerfontein Old Age Facility",null,"Renewal",null,null,null,"Community Facilities","Indoor Facilities",18,null,null,0]
[null,"Modjadjiskloof Sports Facilities",null,"Renewal",null,null,null,"Sport and Recreation Facilities","Outdoor Facilities",29,null,null,300000]
[null,"Kgapane Stadium Phase Upgrading",null,"New",null,null,null,"Community Facilities","Nature Reserves","                    03,04",null,null,16081532.539999999]
[null,"Ramodumo Youth Centre ",null,"New",null,null,null,"Community Facilities","Indoor Facilities",26,null,null,0]
[null,"Mandela Park Youth Centre",null,"New",null,null,null,"Community Facilities","Indoor Facilities",8,null,null,0]
[null,"Ga-Kgapane Park",null,"Renewal",null,null,null,"Community Facilities","Outdoor Facilities","Ward 3/4",null,null,0]
[null,"Mamokgadi Youth Centre",null,"New",null,null,null,"Community Facilities","Indoor Facilities",24,null,null,0]
[null,"Phooko/Raphahlelo Youth centre",null,"New",null,null,null,"Community Facilities","Indoor Facilities",15,null,null,0]
[]
["Waste Management","Modjadjiskloof Transfer stations",null,"New",null,null,null,"Solid Waste Infrastructure","Waste Transfer Stations",29,null,null,0]
[null,"Waste Management bakkie",null,"New",null,null,null,"Transport Assets","Capital Spares",29,null,null,0]
[null,"Skip Bins (15)",null,"New",null,null,null,"Machinery and Equipment","Capital Spares",29,null,null,1440000]
[null,"Trolley Bins",null,"New",null,null,null,"Machinery and Equipment","Capital Spares",29,null,null,200000]
[null,"Landfill Site (Maphalle)",null,"Renewal",null,null,null,"Solid Waste Infrastructure","Landfill Sites",20,null,null,1700000,null,2000000,3700000]
[null,"Rehabiliation of Old Modjadjiskloof Dumping site",null,"New",null,null,null,"Solid Waste Infrastructure","Landfill Sites",29,null,null,0]
[null,"Drop off centre (Waste temporary storage) Mamaila Phaphadi and Tlhotlhokwe",null,null,null,null,null,"Solid Waste Infrastructure","Waste Drop-off Points","                    22/27",null,null,0]
[null,"Chain Saws",null,"New",null,null,null,"Machinery and Equipment","Capital Spares",29,null,null,0]
[null,"Grass Cutting Machine",null,"New",null,null,null,"Machinery and Equipment","Capital Spares",29,null,null,400000]
[null,"Refuse Compactor Truck",null,"New",null,null,null,"Transport Assets","Capital Spares",29,null,null,1500000]
[null,"Rural transfer stations",null,"New",null,null,null,"Solid Waste Infrastructure","Capital Spares",29,null,null,0]
[null,"TLB ",null,"New",null,null,null,"Transport Assets","Capital Spares",29,null,null,900000]
[null,"Brush Cutters",null,"New",null,null,null,"Machinery and Equipment","Capital Spares",29,null,null,0]
[]
["Storm Water","Ga-Kgapane Storm water Channels",null,"New",null,null,null,"Storm water Infrastructure","Storm water Conveyance","Ward 3/4",null,null,1900000]
[null,"Modjadjiskloof Channels",null,"New",null,null,null,"Storm water Infrastructure","Storm water Conveyance",29,null,null,0]
[null,"Low level Bridges",null,"New",null,null,null,"Storm water Infrastructure","Storm water Conveyance",null,null,null,3764654.54,null,6505688,19013657,12578789,17294944]
[]
["Roads","Kgapane Side Walks",null,"Renewal",null,null,null,"Roads Infrastructure","Roads","03,04",null,null,0]
[null,"Modjadjiskloof Side Walks",null,"Renewal",null,null,null,"Roads Infrastructure","Roads",29,null,null,0]
[null,"Sekgopo Gabions",null,"New",null,null,null,"Roads Infrastructure","Roads",9,null,null,0]
[null,"Shamfana Street paving",null,"New",null,null,null,"Roads Infrastructure","Roads",25,null,null,0]
[null,"Medingen Street Paving",null,"New",null,null,null,"Roads Infrastructure","Roads",5,null,null,0]
[null,"Madumeleng- Tibeng Street Paving Phase 2",null,"New",null,null,null,"Roads Infrastructure","Roads",1,null,null,0]
[null,"Ward 5 Street Paving (Malematsa)",null,"New",null,null,null,"Roads Infrastructure","Roads",5,null,null,0]
[null,"Ward 9 (Sekgopo Street Paving)",null,"New",null,null,null,"Roads Infrastructure","Roads",9,null,null,0]
[null,"Maapana Street Paving ",null,"New",null,null,null,"Roads Infrastructure","Roads","03,04",null,null,0]
[null,"Las Vegas Street Paving",null,"New",null,null,null,"Roads Infrastructure","Roads","                  03,04",null,null,1948852.39]
[null,"Ditshosing Street Paving",null,"New",null,null,null,"Roads Infrastructure","Roads",21,null,null,39005.980000000003]
[null,"Mamphakathi Street Paving",null,"New",null,null,null,"Roads Infrastructure","Roads",8,null,null,2078851.78]
[null,"Ga-Ntata Street Paving",null,"New",null,null,null,"Roads Infrastructure","Roads",24,null,null,169575.27]
[null,"Sekgopo Moshate Street Paving",null,"New",null,null,null,"Roads Infrastructure","Roads",9,null,null,3584408.39]
[null,"Mamphakathi Street Paving",null,"New",null,null,null,"Roads Infrastructure","Roads",null,null,null,0]
[null,"Mokwakwaila Library",null,"New",null,null,null,"Roads Infrastructure","Roads",27,null,null,0]
[null,"Maupa Street Paving",null,"New",null,null,null,"Roads Infrastructure","Roads",23,null,null,0]
[null,"Ramoadi Street Paving",null,"New",null,null,null,"Roads Infrastructure","Roads",10,null,null,0]
[null,"Abel Street Paving",null,"New",null,null,null,"Roads Infrastructure","Roads",26,null,null,0]
[null,"Modjadjiskloof Waterfall Paving",null,"New",null,null,null,"Roads Infrastructure","Roads",29,null,null,1000000,null,5000000,6000000]
[null,"Mokgoba Street Paving",null,"New",null,null,null,"Roads Infrastructure","Roads",29,null,null,0]
[null,"Boshakge-Mabulane Street Paving",null,"New",null,null,null,"Roads Infrastructure","Roads",30,null,null,0]
[null,"Matshwi Street Paving",null,"New",null,null,null,"Roads Infrastructure","Roads",11,null,null,0]
[null,"Raphahlelo Head Kraal paving - roll over (Consultant)",null,"New",null,null,null,"Roads Infrastructure","Roads",15,null,null,0]
[null,"4X4 Bakkie",null,"New",null,null,null,"Transport Assets","Roads",null,null,null,0]
[null,"Maphalle Market stalls",null,"New",null,null,null,"Roads Infrastructure","Roads",20,null,null,500000,null,0,500000]
[null,"1X Graders",null,"New",null,null,null,"Transport Assets","Roads",29,null,null,2500000]
[null,"2X Tipper truck",null,"New",null,null,null,"Transport Assets","Roads",29,null,null,0]
[null,"Suction Tanker",null,"New",null,null,null,"Transport Assets","Roads",29,null,null,1400000,null,0,1200000]
[null,"1X Water tankers ",null,"New",null,null,null,"Transport Assets","Roads",29,null,null,1200000]
[null,"1 ton quarter canopy truck for roads and storm water",null,"New",null,null,null,"Transport Assets","Roads",29,null,null,400000]
[null,"Pedestrian roller",null,"New",null,null,null,"Machinery and Equipment","Roads",29,null,null,250000]
[null,"Workshop (4x4 bakkie)",null,"New",null,null,null,"Transport Assets","Roads",29,null,null,500000]
[null,"Fencing of Municipal workshop",null,"New",null,null,null,"Operational Buildings","Roads",29,null,null,700000]
[null,"Re- gravelling of streets",null,"New",null,null,null,"Roads Infrastructure","Roads",null,null,null,2500000]
[null,"Water stand Pipe (water trunks at Ga-Kgapane)",null,"New",null,null,null,"Machinery and Equipment","Roads","                   03,04",null,null,0]
[null,"Rehabilitation of Modjadjiskloof Streets ",null,"New",null,null,null,"Roads Infrastructure","Roads",29,null,null,1700000]
[null,"Rehabilitation of Ga-kgapane Streets - Phase 2",null,"New",null,null,null,"Roads Infrastructure","Roads","                   03,04",null,null,1200000]
[null,"Modjadjiskloof Gabions",null,"New",null,null,null,"Roads Infrastructure","Roads",29,null,null,0]
[null,"Itieleng-Sekgosese Street Paving - Construction",null,"New",null,null,null,"Roads Infrastructure","Roads",12,null,null,800000,null,7000000,3600000,12454525,7644260]
[null,"Refilwe Street paving - Consultant",null,"New",null,null,null,"Roads Infrastructure","Roads",22,null,null,0]
[null,"Mmamakata Raselaka Street Paving - Consultant",null,"New",null,null,null,"Roads Infrastructure","Roads",7,null,null,0]
[null,"Khosotupa Taxi Rank",null,"New",null,null,null,"Roads Infrastructure","Roads",19,null,null,0]
[null,"Wholesaler Taxi Rank",null,"New",null,null,null,"Roads Infrastructure","Roads",18,null,null,0]
[null,"Mmaphakhati Taxi Rank",null,"New",null,null,null,"Roads Infrastructure","Roads",8,null,null,0]
[null,"Rehabiliation of Ga-Kgapane taxi rank, paving extension and storage\ntank",null,"New",null,null,null,"Roads Infrastructure","Roads","                  03,04",null,null,0]
[null,"Lemondokop Street Paving - Construction",null,"New",null,null,null,"Roads Infrastructure","Roads",18,null,null,800000,null,6000000,4000000,12454525,8454525]
[null,"Modjadji Ivory Route Phase I",null,"New",null,null,null,"Roads Infrastructure","Roads",29,null,null,6000000]
[null,"Makaba Street Paving",null,"New",null,null,null,"Roads Infrastructure","Roads",2,null,null,0]
[null,"Rasewana and Lenokwe (Designs)",null,"New",null,null,null,"Roads Infrastructure","Roads",1,null,null,500000,null,10000000,7000000]
[null,"Jamela street paving",null,"New",null,null,null,"Roads Infrastructure","Roads",19,null,null,0]
[null,"Sedibeng street Paving",null,"New",null,null,null,"Roads Infrastructure","Roads",23,null,null,0]
[null,"Upgrading of  streets-Mokgoba",null,"New",null,null,null,"Roads Infrastructure","Roads",29,null,null,0]
[null,"Mmamokgadi Street Paving",null,"New",null,null,null,"Roads Infrastructure","Roads",24,null,null,0,null,5000000,3500000,6500000,6500000]
[null,"Mapaana Street Upgrade ",null,"New",null,null,null,"Roads Infrastructure","Roads","03,04",null,null,0,null,300000,300000,15000000,12332072]
[null,"Khethothone Street paving",null,"New",null,null,null,"Roads Infrastructure","Roads",7,null,null,0,null,300000,300000,15000000,12332072]
[null,"Seatlaleng Street Paving",null,"New",null,null,null,"Roads Infrastructure","Roads",7,null,null,0]
[null,"Roller Compactor (x1)",null,"New",null,null,null,"Machinery and Equipment","Roads",null,null,null,0]
[null,"Tshabelamatswale Street Paving",null,"New",null,null,null,"Roads Infrastructure","Roads",7,null,null,0]
[null,"Ramodumo Street Paving",null,"New",null,null,null,"Roads Infrastructure","Roads",26,null,null,0]
[null,"Block 18 Street paving",null,"New",null,null,null,"Roads Infrastructure","Roads",24,null,null,0]
[null,"Kherobeng street paving",null,"New",null,null,null,"Roads Infrastructure","Roads",null,null,null,0]
[null,"Matshelapata street paving",null,"New",null,null,null,"Roads Infrastructure","Roads",30,null,null,0]
[null,"Jokong Street Paving",null,"New",null,null,null,"Roads Infrastructure","Roads",26,null,null,0,null,null,null,6500000]
[null,"Makhutukwe Street Paving (Planning)",null,"New",null,null,null,"Roads Infrastructure","Roads",1,null,null,400000,null,5900000,5700000,8000000,12000000]
[null,"Paving - Mokwasele Cemetry ",null,"New",null,null,null,"Roads Infrastructure","Roads",6,null,null,600000,null,6000000,5700000,6000000,12000000]
[null,"Sephukubye Street Paving (ward 16)",null,"New",null,null,null,"Roads Infrastructure","Roads",16,null,null,0]
[null,"Moshakga Street Paving",null,"New",null,null,null,"Roads Infrastructure","Roads",2,null,null,600000,null,6000000,5700000,6000000]
[null,"Refurbishment of Modjadjiskloof Taxi Rank",null,"New",null,null,null,"Roads Infrastructure","Roads",29,null,null,800000,null,0,800000]
[null,"Manningburg Street Paving (Designs and Construction)",null,"New",null,null,null,"Roads Infrastructure","Roads","                   03,04",null,null,7000000,null,4500000,4500000]
[null,"Mohlabaneng Street Paving (Fruitshop to graveyard)  Designs",null,"New",null,null,null,"Roads Infrastructure","Roads",21,null,null,0]
[null,"Sehlakong cemetry   (Designs)",null,"New",null,null,null,"Roads Infrastructure","Roads",1,null,null,0]
[null,"Modjadji Valley Street Paving ph 2",null,"New",null,null,null,"Roads Infrastructure","Roads",29,null,null,0]
[]
["Road Transport/ Vehicle licensing & Testing","Stop Watches",null,null,null,null,null,"Machinery and Equipment","Capital Spares",null,null,null,0]
[null,"Road Block Trailer & Equipment",null,null,null,null,null,"Machinery and Equipment","Capital Spares",null,null,null,0]
[null,"Strong Room Modjadjiskloof DLTC",null,"New",null,null,null,"Operational Buildings","Capital Spares",29,null,null,0]
[null,"Resealing of Modjadjiskloof DLTC (Test yard)",null,"New",null,null,null,"Operational Buildings","Capital Spares",29,null,null,980306.26]
[null,"Relocation of Kgapane DLTC to new office",null,"New",null,null,null,"Operational Buildings","Capital Spares","                    03,04",null,null,300000]
[null,"Eye test Apparatus *2 (Modjadjiskloof & Kgapane DLTC)",null,"New",null,null,null,"Machinery and Equipment","Capital Spares",29,null,null,0]
[null,"Obstacles 60 (poles & pedestals) Modjadjiskloof DLTC",null,"New",null,null,null,"Machinery and Equipment","Capital Spares",29,null,null,150000]
[null,"Firearm and  ammunition",null,"New",null,null,null,"Machinery and Equipment","Capital Spares",29,null,null,0]
[null,"Office safe & brick safe",null,"New",null,null,null,"Machinery and Equipment","Capital Spares",29,null,null,50000]
[null,"Supply and installation Cubicles (Kgapane Licensing Office)",null,"New",null,null,null,"Operational Buildings","Capital Spares","                   03,04",null,null,0]
[null,"Refurbishment of Modjadjiskloof K53 Testing Ground",null,"New",null,null,null,"Operational Buildings","Capital Spares",29,null,null,0]
[null,"Two Way Radios",null,"New",null,null,null,"Machinery and Equipment","Capital Spares",29,null,null,0]
[null,"Visitors Firearm Storage safes",null,"New",null,null,null,"Furniture and Office Equipment","Capital Spares",29,null,null,6000]
[null,"Boom Gate Main Entrance",null,"New",null,null,null,"Operational Buildings","Capital Spares",29,null,null,0]
[]
["Electricity / Electricity Distribution","Prepaid Meters in Mokgoba Village",null,"New",null,null,null,"Electrical Infrastructure","LV Networks",29,null,null,500000]
[null,"Split metering in Modjadjiskloof ",null,"New",null,null,null,"Electrical Infrastructure","LV Networks",29,null,null,1176351.6000000001]
[null,"Upgrade of Electricity to NERSA Standards-NERSA Compliance",null,"New",null,null,null,"Electrical Infrastructure","LV Networks",29,null,null,924760]
[null,"Refurbishment of Electricity Network Phase 2",null,"New",null,null,null,"Electrical Infrastructure","LV Networks",29,null,null,0]
[null,"Refurbishing of LV network",null,"New",null,null,null,"Electrical Infrastructure","LV Networks",29,null,null,3800000]
[null,"Re-routing of Chritinas Rest HV line",null,"New",null,null,null,"Electrical Infrastructure","HV Switching Station",29,null,null,1400000]
[null,"500kVA mini sub",null,"New",null,null,null,"Electrical Infrastructure","MV Substations",29,null,null,0]
[null,"315kVA pole transformer ",null,"New",null,null,null,"Electrical Infrastructure","MV Substations",29,null,null,200000]
[null,"200kVA pole transformer",null,"New",null,null,null,"Electrical Infrastructure","MV Substations",29,null,null,150000]
[null,"Installation of Efficient energy Streetlights (50)",null,"New",null,null,null,"Electrical Infrastructure","MV Substations",29,null,null,0]
[null,"Streetlights meterings",null,"New",null,null,null,"Electrical Infrastructure","LV Networks",29,null,null,0]
[null,"Council Building metering",null,"New",null,null,null,"Electrical Infrastructure","LV Networks",29,null,null,0]
[null,"Highmast control boxes & cables",null,"New",null,null,null,"Electrical Infrastructure","LV Networks",29,null,null,0]
[null,"4*4 double cab bakkie",null,"New",null,null,null,"Electrical Infrastructure","Capital Spares",29,null,null,0]
[null,"4 Ton diesel truck",null,"New",null,null,null,"Electrical Infrastructure","Capital Spares",29]
[null,"4*4 Multi Purpose mini TLB",null,"New",null,null,null,"Electrical Infrastructure","Capital Spares",29,null,null,0]
[null,"25kVA Generator trailer set",null,"New",null,null,null,"Electrical Infrastructure","Capital Spares",29,null,null,0]
[null,"Electric transformer",null,"New",null,null,null,"Electrical Infrastructure","Capital Spares",29,null,null,0]
[]
["INEP","Household Connection in 7 Villages",null,"New",null,null,null,"Electrical Infrastructure","LV Networks",null,null,null,5983000,null,10635000,10635000,12500000,12500000]
[]
["MIG","Upgrading of streets -Mokgoba ",null,"New",null,null,null,"Roads Infrastructure","Roads",29]
[null,"Upgrading of streets -Modjadji Valley ",null,"New",null,null,null,"Roads Infrastructure","Roads",29]
[null,"Senwamokgope Street Paving",null,"New",null,null,null,"Roads Infrastructure","Roads",13]
[null,"Upgrading of streets - Kuranta",null,"New",null,null,null,"Roads Infrastructure","Roads",26,null,null,0]
[null,"Kgapane Stadium Phase 3",null,"New",null,null,null,"Sport and Recreation Facilities","Outdoor Facilities","                   03,04",null,null,11001978,null,null,8233189]
[null,"Kgapane Stadium bridge",null,"New",null,null,null,"Roads Infrastructure","Roads","                   03,04"]
[null,"Senwamokgope Library ",null,"New",null,null,null,"Community Facilities","Libraries",13]
[null,"Sekgopo Library",null,"New",null,null,null,"Community Facilities","Libraries",9]
[null,"Mokwakwaila Library",null,"New",null,null,null,"Community Facilities","Libraries",27]
[null,"Seatlaleng Street Paving     ",null,"New",null,null,null,"Roads Infrastructure","Roads",7]
[null,"Mohlakong Street paving     ",null,"New",null,null,null,"Roads Infrastructure","Roads",2]
[null,"Sephukhubje Street paving  ",null,"New",null,null,null,"Roads Infrastructure","Roads",16]
[null,"Shaamiriri Sports Complex",null,"New",null,null,null,"Roads Infrastructure","Roads",26]
[null,"Matshelapata Street paving  ",null,"New",null,null,null,"Roads Infrastructure","Roads"]
[null,"Shawela Street paving       ",null,"New",null,null,null,"Roads Infrastructure","Roads",20]
[null,"Sekgopo-Maboying Street paving      ",null,"New",null,null,null,"Roads Infrastructure","Roads",9]
[null,"Tlotlokwe Street paving    ",null,"New",null,null,null,"Roads Infrastructure","Roads",27]
[null,"Shamfana Street Paving   ",null,"New",null,null,null,"Roads Infrastructure","Roads",25]
[null,"Kherobeng Street Paving  ",null,"New",null,null,null,"Roads Infrastructure","Roads"]
[null,"Goedplas Community Hall",null,"New",null,null,null,"Community Facilities","Halls",12,null,null,0]
[null,"Thakgalane Community Hall",null,"New",null,null,null,"Community Facilities","Halls",12,null,null,0]
[null,"Ntata Community Hall",null,"New",null,null,null,"Community Facilities","Halls",24,null,null,0]
[null,"Upgrading of streets- Sekgopo Moshate ",null,"New",null,null,null,"Roads Infrastructure","Roads",9,null,null,5283210]
[null,"Upgrading of streets- Mamphakhate ",null,"New",null,null,null,"Roads Infrastructure","Roads",8,null,null,7450000]
[null,"Upgrading of streets- Ramphanyana ",null,"New",null,null,null,"Roads Infrastructure","Roads",6,null,null,0]
[null,"Las Vegas Street  paving",null,"New",null,null,null,"Roads Infrastructure","Roads","                   03,04",null,null,4987800]
[null,"Upgrading of streets- Dichosing ",null,"New",null,null,null,"Roads Infrastructure","Roads",20,null,null,5503600]
[null,"Upgrading of streets -GaNtata",null,"New",null,null,null,"Roads Infrastructure","Roads",24,null,null,5401000]
[null,"Kgapane Indoor Hall",null,"New",null,null,null,"Community Facilities","Halls","                   03,04",null,null,0]
[null,"Mamaila Mphotwane Library",null,"New",null,null,null,"Community Facilities","Libraries",17,null,null,0]
[null,"Abel Library",null,"New",null,null,null,"Community Facilities","Libraries",26,null,null,0]
[null,"Itieleng GaPheeha Library",null,"New",null,null,null,"Community Facilities","Libraries",12,null,null,0]
[null,"Moshakga Youth Information Centre",null,"New",null,null,null,"Community Facilities","Indoor Facilities",2,null,null,0]
[null,"Taolome Youth Information Centre",null,"New",null,null,null,"Community Facilities","Indoor Facilities",27,null,null,0]
[null,"Highmast lights in 12 villages",null,"New",null,null,null,"Electrical Infrastructure","LV Networks",null,null,null,0]
[null,"Sidewalks from Kgapane to Mokwakwaila",null,"New",null,null,null,"Roads Infrastructure","Roads","                   03,27",null,null,0]
[null,"Thakgalane Sports Complex",null,"New",null,null,null,"Sport and Recreation Facilities","Outdoor Facilities",12,null,null,5593206,null,17000000,18000000,14999408,20181858]
[null,"Madumeleng/Shotong Sports Complex",null,"New",null,null,null,"Sport and Recreation Facilities","Outdoor Facilities","                   01,06",null,null,5593206,null,17000000,18000000,16341500,20651030]
[null,"Ramodumo Street Paving",null,"New",null,null,null,"Roads Infrastructure","Roads",26,null,null,0,null,12093412,null,4206587,600000]
[null,"Mamokgadi Street Paving",null,"New",null,null,null,"Roads Infrastructure","Roads",24,null,null,0,null,500000,null,11500000,600000]
[null,"Jokong Street Paving",null,"New",null,null,null,"Roads Infrastructure","Roads",25,null,null,2823000,null,500000,10259810,11393413,16408019]
[null,"Lebaka Sports complex phase2",null,"New",null,null,null,"Sport and Recreation Facilities","Outdoor Facilities",19,null,null,0]
[null,"GLM Show Ground",null,"New",null,null,null,"Sport and Recreation Facilities","Outdoor Facilities",29,null,null,0]
[null,"Rampepe Access Bridge",null,"New",null,null,null,"Roads Infrastructure","Roads",27,null,null,0,null,7399588,0,0,0]
[null,"Upgrading of Market Stalls in Modjadjiskloof",null,"New",null,null,null,"Roads Infrastructure","Roads",29,null,null,0]
[null,"PMU Management",null,null,null,null,null,null,null,null,null,null,0,null,0,3115000,0,2342019]
[]
[]
[]
[]
[]
[]
["Entities:"]
["List all capital projects grouped by Municipal Entity"]
[]
["Entity Name"]
["Project name"]
[]
[]
[]
[]
["References"]
["List all projects where approved budgets have been adjusted"]
["Refer MFMA s30"]
["Asset class as per table B9 and asset sub-class as per table SB18"]
["GPS coordinates correct to seconds. Provide a logical starting point on networked infrastructure."]
["Distinguish projects approved in terms of MFMA section 19(1)(b) and MRRR Regulation 13"]
["Project Number consists of MSCOA Project Longcode and seq No (sample PC001002006002_00002)"]

{"sheet":"SB20","index":42,"n_rows":55,"n_cols":13,"rows_kept":55,"cut":false,"hidden":false,"merged":[[0,0,0,12],[1,0,3,0],[1,1,3,1],[1,2,1,10],[52,0,52,12],[48,0,48,12],[49,0,49,12],[46,0,46,12],[47,0,47,12]]}
[{"$f":"muni&\" - \"&ADJB20&\" - \"&Date","v":"LIM332 Greater Letaba - Supporting Table SB20 Not required - 27 February 2019"}]
[{"$f":"desc","v":"Description"},{"$f":"head27","v":"Ref"},{"$f":"Head2","v":"Budget Year 2018/19"},null,null,null,null,null,null,null,null,{"$f":"Head10","v":"Budget Year +1 2019/20"},{"$f":"Head11","v":"Budget Year +2 2020/21"}]
[null,null,{"$f":"Head6","v":"Original Budget"},{"$f":"Head54","v":"Prior Adjusted"},{"$f":"Head51","v":"Accum. Funds"},{"$f":"Head52","v":"Multi-year capital"},{"$f":"Head53","v":"Unfore. Unavoid."},{"$f":"Head55","v":"Nat. or Prov. Govt"},{"$f":"Head50","v":"Other Adjusts."},{"$f":"Head56","v":"Total Adjusts."},{"$f":"Head7","v":"Adjusted Budget"},{"$f":"Head7","v":"Adjusted Budget"},{"$f":"Head7","v":"Adjusted Budget"}]
[null,null,null,3,4,5,6,8,9,10,11]
["R thousands",null,"A","A1","B","C","D","E","F","G","H"]
["Revenue By Municipal Entity"]
["Entity 1 total revenue",null,null,null,null,null,null,null,null,{"$f":"SUM(E7:I7)","v":0},{"$f":"IF(D7=0,C7+J7,D7+J7)","v":0}]
["Entity 2 total revenue",null,null,null,null,null,null,null,null,0,0]
["Entity 3 (etc) total revenue",null,null,null,null,null,null,null,null,0,0]
[null,null,null,null,null,null,null,null,null,0,0]
[null,null,null,null,null,null,null,null,null,0,0]
[null,null,null,null,null,null,null,null,null,0,0]
[null,null,null,null,null,null,null,null,null,0,0]
[null,null,null,null,null,null,null,null,null,0,0]
[null,null,null,null,null,null,null,null,null,0,0]
[null,null,null,null,null,null,null,null,null,0,0]
["Total Operating Revenue",1,{"$f":"SUM(C7:C16)","v":0},0,0,0,0,0,0,0,0,0,0]
[]
["Expenditure By Municipal Entity"]
["Entity 1 total operating expenditure",null,null,null,null,null,null,null,null,{"$f":"SUM(E20:I20)","v":0},{"$f":"IF(D20=0,C20+J20,D20+J20)","v":0}]
["Entity 2 total operating expenditure",null,null,null,null,null,null,null,null,0,0]
["Entity 3 etc. total operating expenditure",null,null,null,null,null,null,null,null,0,0]
[null,null,null,null,null,null,null,null,null,0,0]
[null,null,null,null,null,null,null,null,null,0,0]
[null,null,null,null,null,null,null,null,null,0,0]
[null,null,null,null,null,null,null,null,null,0,0]
[null,null,null,null,null,null,null,null,null,0,0]
[null,null,null,null,null,null,null,null,null,0,0]
[null,null,null,null,null,null,null,null,null,0,0]
["Total Operating Expenditure",2,{"$f":"SUM(C20:C29)","v":0},0,0,0,0,0,0,0,0,0,0]
[]
["Capital Expenditure By Municipal Entity"]
["Entity 1 total capital expenditure",null,null,null,null,null,null,null,null,{"$f":"SUM(E33:I33)","v":0},{"$f":"IF(D33=0,C33+J33,D33+J33)","v":0}]
["Entity 2 total capital expenditure",null,null,null,null,null,null,null,null,0,0]
["Entity 3 etc. total capital expenditure",null,null,null,null,null,null,null,null,0,0]
[null,null,null,null,null,null,null,null,null,0,0]
[null,null,null,null,null,null,null,null,null,0,0]
[null,null,null,null,null,null,null,null,null,0,0]
[null,null,null,null,null,null,null,null,null,0,0]
[null,null,null,null,null,null,null,null,null,0,0]
[null,null,null,null,null,null,null,null,null,0,0]
[null,null,null,null,null,null,null,null,null,0,0]
["Total Capital Expenditure",2,{"$f":"SUM(C32:C42)","v":0},0,0,0,0,0,0,0,0,0,0]
[{"$f":"head27a","v":"References"}]
["1. Must reconcile to the sum of all municipal entity monthly revenue reports"]
["2. Must reconcile to the sum of all municipal entity monthly expenditure reports"]
["3. Only complete if a previous adjusted budget has been approved in the same financial year. Reflect most recent adjusted budget."]
["4. Additional cash-backed accumulated funds/unspent funds identified after Original Budget approved and after annual financial statements audited (note: only where underspending could not reasonably be have foreseen)"]
["5. Increases of funds approved under section 87 MFMA"]
["6. Adjustments approved in accordance with section 87 MFMA"]
["7. Adjustments made under delegation by the AO since the budget was approved or since a previously 'approved' Adjustments Budget in the same financial year"]
["8. Adjustments to funding allocations by National or Provincial Government"]
["9. Adjusts. = 'Other' Adjustments approved by entity Board; including revenue under-collection ; additional revenue appropriation on existing programmes; projected savings; error correction"]
["10. H = B + C + D + E + F + G"]
["11. Adjusted Budget (I) = (A or A1/2 etc) + H"]